program: Gaussian 09
title: 000141529
version: EM64L-G09RevD.01
frameworkgroup: C1[X(C9H19NO3SSi)]
method: RPBEPBE
basis: SDD
operation: Freq
keyword: #p
keyword: freq=noraman
keyword: PBEPBE/SDD
title: #p freq=noraman PBEPBE/SDD
converged: NO YES NO NO
title: Mulliken charges:
elementType: S Si O O O N C C C C C C C C C H H H H H H H H H H H H H H H H H H H
charge: -0.048994 1.510939 -0.531628 -0.538740 -0.537416 -0.254071 -0.367301 -0.367797 -0.367089 -0.862033 -0.272171 -0.268590 -0.272026 -0.267054 -0.705051 0.241760 0.244208 0.220235 0.233926 0.220719 0.233762 0.220436 0.233461 0.223358 0.191235 0.223498 0.191266 0.222412 0.191829 0.239743 0.216099 0.252332 0.260162 0.088580
chargesum: 0.00000
title: Mulliken charges with hydrogens summed into heavy atoms:
elementType: S Si O O O N C C C C C C C C C
charge: 0.039586 1.510939 -0.531628 -0.538740 -0.537416 -0.254071 0.086860 0.086684 0.086808 -0.376065 0.142422 0.146175 0.142215 0.188788 -0.192556
polarizability: 1.75497818e+02 7.30586258e+00 1.35150462e+02 -1.72225547e+00 3.25225368e+00 1.29556512e+02
1716.lowfreq: -8.8779 0.0012 0.0017 0.0022 3.6390 13.2099 26.3512 48.4241 67.0757
frequency: 26.1728 48.4005 67.0676 79.7482 108.1189 136.9851 148.7425 175.9474 187.0394 201.5783 220.3775 242.6843 256.2252 273.8199 289.4758 322.1989 325.7763 371.1605 415.8955 419.6045 453.6874 515.4565 557.2133 582.9651 585.4864 658.1910 659.1293 686.5324 722.9683 729.8993 756.1950 789.2654 850.9569 863.5697 865.1330 881.0366 921.3327 922.2032 1000.4199 1002.4006 1025.3776 1047.1006 1047.9661 1056.7778 1065.9269 1069.6747 1069.9940 1090.3333 1120.1165 1152.7156 1154.4183 1201.2615 1208.4683 1218.0615 1218.7195 1250.0183 1251.8237 1264.9177 1265.9748 1269.5099 1292.2066 1328.8179 1341.7715 1345.4070 1346.2712 1357.2998 1360.9574 1362.4552 1431.2267 1447.5025 1456.9551 1461.0908 1461.9083 1479.5469 1483.5450 1484.8120 1490.4037 2435.5838 2953.6571 2954.0163 2955.0631 2964.3605 2964.9132 2970.9114 2989.1027 2996.6817 3019.8073 3042.1239 3046.3084 3047.4799 3048.2397 3061.2779 3064.1804 3067.6486 3068.8594 3096.2519
redmass: 5.2356 6.3477 1.7756 4.2823 2.9873 4.3363 2.9761 5.2009 2.5883 2.2706 1.2764 4.3283 3.5788 3.5638 2.5195 3.3514 3.4932 4.2400 3.1592 3.1565 4.1458 8.3382 2.9692 2.7436 2.7879 3.9178 4.1124 7.9880 1.7863 1.4669 1.5141 3.6380 1.2782 1.9407 1.9087 2.2798 2.1668 2.1510 2.6346 1.7952 2.6908 2.3868 2.5692 2.8818 2.2397 4.6045 5.3512 3.5956 1.1113 1.7012 1.7044 1.0949 1.2593 1.2522 1.2552 1.1789 1.2629 1.5334 1.5342 1.2459 1.0843 1.3676 1.2687 1.2644 1.2603 1.2909 1.3297 1.3249 1.0826 1.0789 1.0905 1.0898 1.0861 1.0890 1.0802 1.0811 1.0802 1.0382 1.0662 1.0660 1.0655 1.0670 1.0669 1.0672 1.0601 1.0597 1.0580 1.0985 1.0955 1.0953 1.0951 1.0975 1.1023 1.0987 1.0986 1.1073
irintensity: 0.6487 1.2825 2.8969 9.1484 3.6266 4.8677 5.0671 22.5727 0.1380 10.4784 27.4823 8.8826 9.2642 35.8148 5.3673 3.8780 3.4836 3.0905 0.2601 0.3080 9.1236 1.3191 80.3792 6.7950 6.4295 38.3115 36.1602 133.5106 13.0859 22.9210 55.3281 101.8350 7.4070 12.5976 10.2932 68.1037 17.5441 16.1184 32.5849 23.0408 23.8239 14.4574 18.9664 0.6204 53.5174 87.0429 87.7817 152.1270 1.2822 4.0281 2.9649 7.1691 34.4613 1.6039 1.7254 11.9071 5.9631 14.8090 10.5464 22.2081 1.6696 1.7578 4.7175 1.6125 0.9634 2.8961 2.4338 1.9907 6.9338 5.6509 8.2967 10.0001 4.0622 10.4789 8.7593 5.5198 6.6776 32.8459 49.3484 32.5889 18.7073 72.6518 61.0349 179.7255 1.0432 20.5525 36.1189 1.9544 36.8739 39.7568 36.8994 1.9832 9.8599 44.6536 44.1834 30.4151
temp: 298.150 k
press: 1.00000 atm
elementType: 16 14 8 8 8 7 6 6 6 6 6 6 6 6 6 1 1 1 1 1 1 1 1 1 1 1 1 1 1 1 1 1 1 1
symmnumber: 1
zpe: 735995.6 jmol-1
zpe.correction: 0.280326 hartree
zpe.thermalcorrener: 0.297051 hartree
zpe.thermalcorrenthalpy: 0.297995 hartree
zpe.thermalcorrgfe: 0.235460 hartree
zpe.sumelectzpe: -1321.067604 hartree
zpe.sumelectthermal: -1321.050879 hartree
zpe.sumelectthermalent: -1321.049935 hartree
zpe.sumelectthermalfe: -1321.112470 hartree
dipole: 8.1589 -1.8935 -0.7698
dipole: 8.4110
quadrupole: -106.7188 -103.4640 -102.8845
quadrupole: -5.2620 4.6004 1.8898
quadrupole: -2.3631 0.8918 1.4713 -5.2620 4.6004 1.8898
hfenergy: -1321.34793 hartree
pointgroup: C01 [X(C9H19N1O3S1Si1)]
dipole: 3.2450595 0.5669299 0.3139469 debye
polarizability: 174.1366866|-9.6036676|137.0341921|4.5338472|1.8139137|129.0339135 unknown
InChI: InChI=1S/C9H19NO3SSi/c14-8-1-9-15-11-5-2-10(3-6-12-15)4-7-13-15/h14H,1-9H2
charge 0 multiplicity 1
34 atoms
S  -5.736274 0.854325 -0.349418
Si -0.133333 -0.452547 0.089193
O  0.718149 -1.971325 0.365403
O  -0.063217 0.207813 -1.541988
O  -0.125193 0.71895 1.406044
N  2.172168 0.304811 0.007919
C  2.926388 -0.976389 -0.036644
C  2.200874 1.107567 -1.244054
C  2.298844 1.082229 1.269665
C  -1.93102 -1.046793 0.162769
C  2.114661 -2.034131 0.748957
C  1.180001 0.489454 -2.229835
C  0.917973 1.708025 1.583868
C  -2.971018 0.072502 -0.098424
C  -4.408116 -0.466802 -0.009427
H  -2.091832 -1.498048 1.16124
H  -2.045332 -1.861544 -0.578035
H  3.956244 -0.873543 0.365424
H  2.996384 -1.290547 -1.092962
H  3.216745 1.156339 -1.689403
H  1.882454 2.135062 -0.995361
H  3.091034 1.857798 1.208148
H  2.566759 0.378175 2.077285
H  2.483212 -3.050235 0.521946
H  2.212125 -1.867765 1.842636
H  0.961818 1.194892 -3.051224
H  1.583654 -0.444554 -2.675355
H  0.882466 2.054702 2.632029
H  0.725754 2.581381 0.925083
H  -2.805394 0.517331 -1.09698
H  -2.830263 0.882333 0.6443
H  -4.614111 -0.910884 0.979832
H  -4.597734 -1.233453 -0.780779
H  -5.38407 1.682269 0.70535
