program: Gaussian 09
title: 000011289
version: EM64L-G09RevD.01
frameworkgroup: C1[X(C23H21ClO3)]
method: RPBEPBE
basis: SDD
operation: Freq
keyword: #p
keyword: freq=noraman
keyword: PBEPBE/SDD
title: #p freq=noraman PBEPBE/SDD
converged: YES YES NO NO
title: Mulliken charges:
elementType: Cl O O O C C C C C C C C C C C C C C C C C C C C C C C H H H H H H H H H H H H H H H H H H H H H
charge: -0.062273 -0.264121 -0.264066 -0.262351 0.363591 0.290074 0.271700 -0.497854 0.460528 -0.363458 -0.373327 -0.390198 -0.406969 -0.360966 -0.358248 -0.361770 -0.362187 -0.353139 -0.388102 0.313661 0.307086 -0.358854 -0.357250 0.312815 -0.538172 -0.537538 -0.538425 0.259819 0.261068 0.250942 0.255382 0.249540 0.251256 0.238891 0.239286 0.259118 0.256027 0.250395 0.240776 0.219534 0.222869 0.245091 0.221572 0.245822 0.220400 0.222331 0.246150 0.223543
chargesum: 0.00000
title: Mulliken charges with hydrogens summed into heavy atoms:
elementType: Cl O O O C C C C C C C C C C C C C C C C C C C C C C C
charge: -0.062273 -0.264121 -0.264066 -0.262351 0.363591 0.290074 0.271700 -0.497854 0.460528 -0.103639 -0.112258 -0.139257 -0.151587 -0.111426 -0.106991 -0.122880 -0.122900 -0.094021 -0.132075 0.313661 0.307086 -0.108459 -0.116475 0.312815 0.149322 0.150256 0.153599
polarizability: 4.42487918e+02 8.08878858e+00 3.08189281e+02 8.74152134e+00 9.03508024e+00 1.82913364e+02
1716.lowfreq: -7.8625 -4.6796 -3.8880 0.0010 0.0014 0.0015 21.0769 24.8156 33.8453
frequency: 20.9299 24.7847 33.8263 42.4251 44.7070 54.1117 65.9978 94.7675 99.9204 103.7006 117.6584 138.2538 159.8082 171.7058 190.3962 199.2881 211.8080 221.0681 230.5418 237.3676 247.9514 261.8222 281.6893 308.2472 339.4597 354.4818 373.8692 411.8522 414.2140 417.7263 424.1298 452.3299 466.2511 470.4078 506.4194 519.5693 535.5205 540.6566 563.0832 581.2668 618.7622 626.6485 630.5199 665.4130 705.6783 730.0774 737.1850 739.6101 750.0969 767.9721 795.2058 811.6714 812.6186 817.3656 833.9219 839.4725 840.6205 849.2564 930.4352 944.9775 947.8347 953.2991 967.2327 969.4159 970.5337 985.5757 987.1380 987.7025 1001.4427 1002.4907 1006.2271 1111.4814 1111.9434 1112.3533 1113.3743 1114.9174 1115.4281 1147.3538 1156.8836 1157.2135 1157.7495 1176.8036 1179.9835 1185.5455 1230.0127 1231.1162 1234.6493 1247.0103 1285.9433 1300.5349 1302.9702 1305.6649 1354.5847 1357.9281 1363.5085 1418.7786 1420.3791 1423.2716 1435.7640 1436.3268 1436.9536 1466.6528 1467.4715 1468.4396 1471.9873 1472.4754 1473.6429 1490.1014 1495.8523 1500.9192 1564.4418 1568.4453 1570.7496 1587.6957 1614.2120 1614.5310 1618.1227 2959.2646 2959.4473 2961.2976 3046.9551 3047.2257 3050.3065 3124.6753 3124.8717 3126.5743 3136.3079 3137.7827 3146.0501 3147.0178 3147.7812 3148.2720 3162.4366 3163.7214 3167.7082 3169.9104 3171.3427 3172.6841
redmass: 5.6813 4.7090 4.8077 4.2733 3.7617 4.3560 4.6204 3.6658 3.6359 4.9422 4.9875 4.6254 3.8619 4.1151 4.1903 8.1048 2.3861 2.1230 2.3967 1.5989 1.3801 2.1470 3.2874 4.5431 5.0978 6.5618 6.1942 2.9811 2.9863 2.9859 5.4374 4.3886 4.8483 4.5051 3.3558 3.4574 4.0590 2.8347 4.0553 5.3141 6.4469 6.8744 6.9456 5.1213 4.5438 3.9861 5.0585 4.9750 4.5306 5.6084 4.7221 1.3371 1.3230 1.3275 1.9309 1.6425 1.7029 3.4782 2.9294 1.3625 1.3611 1.7794 1.3507 1.3514 1.3838 8.8352 8.7579 8.8120 2.7866 2.6031 2.4160 1.2600 1.3503 1.2604 1.2844 1.3710 1.3675 3.0958 1.3323 1.3299 1.3458 1.2830 1.2874 1.2774 2.6208 2.6699 3.0108 4.7735 4.0874 1.2812 1.2967 1.3395 5.2834 5.4091 5.3414 3.9497 3.8765 3.9669 1.1870 1.1721 1.1721 1.0499 1.0503 1.0503 1.0824 1.0821 1.0788 2.2743 2.4121 2.4910 7.4443 7.2002 7.2278 9.9979 6.3155 6.2378 6.3396 1.0329 1.0329 1.0328 1.1039 1.1039 1.1041 1.0993 1.0993 1.0995 1.0884 1.0882 1.0881 1.0875 1.0881 1.0881 1.0947 1.0950 1.0957 1.0969 1.0971 1.0970
irintensity: 1.0358 0.6872 0.4541 0.2719 0.4388 1.4980 0.7897 4.1056 1.0802 1.8375 5.4406 3.1311 0.3308 1.3652 2.2085 0.0971 2.0884 4.9755 2.7597 3.8801 0.3146 0.8744 6.5324 0.1811 2.7455 3.4993 1.3721 0.0433 0.3206 1.0854 1.2483 0.1530 5.7459 9.5119 2.8405 4.4409 79.7625 23.4908 34.9303 5.2387 2.2827 3.3131 1.5594 4.0283 15.6357 0.1661 7.1947 7.5802 9.5536 16.9765 48.5685 10.0795 19.5754 2.3691 30.4303 51.6046 62.2492 29.7480 8.0901 1.1300 0.9260 4.5651 0.4296 0.7463 0.2550 49.9857 62.1690 38.7555 5.1303 17.8711 14.9312 0.2050 2.2036 0.1912 0.3934 17.5408 14.9200 20.7909 1.2107 7.1664 0.8363 91.1720 277.5281 10.8297 226.9414 251.0595 43.2962 159.2109 50.9647 0.8333 3.7308 2.8347 4.0844 17.8577 20.9287 5.0447 6.9200 2.2285 8.5515 13.4185 14.7285 13.4797 14.1175 13.6350 54.7939 86.6311 60.6961 15.1831 99.1721 198.2355 4.3999 10.6065 16.1896 2.6319 103.3103 63.7351 179.3807 53.4933 113.4017 73.0572 47.5144 45.7162 43.5849 38.0227 23.3046 29.8569 8.2271 6.8179 5.9413 6.6131 8.0502 4.6739 16.5386 18.0118 12.2250 4.4390 5.5053 6.1331
temp: 298.150 k
press: 1.00000 atm
elementType: 17 8 8 8 6 6 6 6 6 6 6 6 6 6 6 6 6 6 6 6 6 6 6 6 6 6 6 1 1 1 1 1 1 1 1 1 1 1 1 1 1 1 1 1 1 1 1 1
symmnumber: 1
zpe: 983953.7 jmol-1
zpe.correction: 0.374768 hartree
zpe.thermalcorrener: 0.400381 hartree
zpe.thermalcorrenthalpy: 0.401325 hartree
zpe.thermalcorrgfe: 0.317062 hartree
zpe.sumelectzpe: -1572.806641 hartree
zpe.sumelectthermal: -1572.781028 hartree
zpe.sumelectthermalent: -1572.780084 hartree
zpe.sumelectthermalfe: -1572.864347 hartree
dipole: 0.0389 5.1308 1.8209
dipole: 5.4444
quadrupole: -133.2427 -156.9852 -159.1989
quadrupole: 5.7350 -14.4307 6.8874
quadrupole: 16.5662 -7.1763 -9.3899 5.7350 -14.4307 6.8874
hfenergy: -1573.1814088 hartree
pointgroup: C01 [X(C23H21Cl1O3)]
dipole: -0.2053372 1.9715782 0.8117444 debye
polarizability: 439.1245523|21.7561103|310.203282|10.0101625|16.1891091|184.2627284 unknown
InChI: InChI=1S/C23H21ClO3/c1-25-19-10-4-16(5-11-19)22(17-6-12-20(26-2)13-7-17)23(24)18-8-14-21(27-3)15-9-18/h4-15H,1-3H3
charge 0 multiplicity 1
48 atoms
Cl 0.780849 -3.325504 -0.788678
O  6.328365 -0.553042 0.60728
O  -1.921476 4.560985 -0.35796
O  -5.774587 -2.473263 -0.065592
C  0.640258 -0.588713 -0.207399
C  2.123284 -0.582633 -0.023759
C  -0.033227 0.752688 -0.216768
C  -0.105057 -1.733355 -0.391231
C  -1.568673 -1.915112 -0.299107
C  2.770599 -1.467928 0.886337
C  -1.011578 1.090931 -1.196779
C  2.929731 0.351797 -0.72318
C  0.328594 1.748315 0.727652
C  4.160521 -1.428464 1.07702
C  -1.615855 2.357214 -1.216798
C  4.330596 0.396806 -0.55481
C  -0.274299 3.025507 0.726782
C  -2.283366 -2.755023 -1.202798
C  -2.304559 -1.270319 0.732633
C  4.949782 -0.500946 0.349923
C  -1.255464 3.330418 -0.249449
C  -3.673289 -2.91605 -1.100919
C  -3.700559 -1.423542 0.848165
C  -4.391778 -2.245759 -0.07756
C  7.191128 0.366347 -0.138212
C  -1.572574 5.607245 0.605863
C  -6.563512 -1.806006 0.973742
H  2.172466 -2.188804 1.452137
H  -1.288733 0.350299 -1.953584
H  2.453614 1.050278 -1.420067
H  1.093403 1.519245 1.477751
H  4.658609 -2.103071 1.779911
H  -2.360923 2.620669 -1.973546
H  4.917731 1.122434 -1.125322
H  0.026619 3.761942 1.477981
H  -1.735052 -3.284206 -1.988492
H  -1.773693 -0.64034 1.453042
H  -4.225115 -3.555489 -1.796429
H  -4.229661 -0.911491 1.657135
H  6.947726 1.422755 0.088996
H  7.113713 0.194906 -1.229529
H  8.212658 0.14066 0.201309
H  -0.502837 5.883893 0.530524
H  -2.198614 6.469448 0.333201
H  -1.801419 5.293071 1.642984
H  -6.255606 -2.134045 1.985534
H  -7.602933 -2.111841 0.785202
H  -6.478208 -0.704605 0.897962
