program: Gaussian 09
title: 000141456
version: EM64L-G09RevD.01
frameworkgroup: C1[X(C13H18O2)]
method: RPBEPBE
basis: SDD
operation: Freq
keyword: #pfreq=noraman
keyword: PBEPBE/SDD
title: #p freq=noraman PBEPBE/SDD
converged: YES YES NO NO
title: Mulliken charges:
elementType: O O C C C C C C C C C C C C C H H H H H H H H H H H H H H H H H H
charge: -0.280971 -0.227606 -0.151029 -0.040829 -0.613562 -0.728546 -0.725638 0.493768 0.202581 -0.412415 -0.398174 -0.229623 -0.228360 -0.242148 -0.505423 0.248897 0.224661 0.225827 0.223983 0.225824 0.209495 0.217328 0.210831 0.236137 0.215560 0.236468 0.227584 0.222687 0.222471 0.226468 0.245997 0.240156 0.227602
chargesum: 0.00000
title: Mulliken charges with hydrogens summed into heavy atoms:
elementType: O O C C C C C C C C C C C C C
charge: -0.280971 -0.227606 0.097868 0.183832 -0.163752 -0.075899 -0.063110 0.493768 0.202581 -0.175948 -0.170591 -0.006935 -0.005889 -0.015680 0.208331
polarizability: 1.67641458e+02 1.18831253e+01 1.39230877e+02 1.09413764e+01 -1.45880540e+01 1.14750627e+02
1716.lowfreq: -15.8314 -8.2904 -0.0008 -0.0004 0.0007 3.9601 16.0439 39.7597 44.6410
frequency: 15.5714 39.6925 44.3723 56.0834 66.9639 97.5340 115.8578 153.7983 184.7731 206.8033 214.1965 220.4470 267.2066 298.2635 342.2088 347.9519 394.3375 402.8048 411.4590 463.7659 531.1884 578.0011 617.3394 639.3858 698.5858 703.9166 748.9019 772.1992 801.6852 851.5099 859.9526 894.4223 919.0916 923.9065 930.9000 957.1537 974.3328 990.2488 992.4777 994.8738 1023.0854 1029.4440 1077.0795 1108.7605 1111.6653 1120.7513 1147.0061 1161.0792 1168.9521 1171.5834 1186.6165 1211.4980 1221.7749 1251.2505 1295.8600 1307.9798 1318.6424 1319.6315 1333.9475 1381.8457 1383.6543 1399.9223 1421.3010 1440.3389 1451.1015 1462.9769 1465.1589 1469.8507 1474.4526 1481.0436 1484.6519 1491.9982 1592.8014 1614.5921 1641.4502 2973.1349 2976.3828 2981.9025 3001.8920 3002.5438 3011.0131 3064.4107 3065.9323 3073.3962 3074.9304 3079.7832 3102.7671 3110.9166 3118.8437 3132.2782 3142.7837 3144.8406 3161.2710
redmass: 3.7434 3.7143 2.6398 5.8727 3.7689 1.5096 1.8558 3.1262 2.8671 4.7449 1.2590 1.2815 2.7382 3.7220 2.9985 2.2088 2.5728 2.8051 2.5172 3.8078 3.3441 4.8610 6.2285 3.0178 6.7969 1.8055 2.2541 3.3197 4.2572 1.2562 2.2644 1.8872 1.1825 1.7094 1.8308 1.4319 1.3978 4.9222 1.8393 2.3492 3.0021 2.3148 1.7267 2.5612 1.2895 1.6252 1.4745 1.9021 1.8089 1.0594 1.1151 2.1560 2.5326 1.3923 1.3134 1.3583 1.3462 1.4940 1.2541 2.0517 2.0885 1.2056 1.1783 2.1321 1.0507 1.0671 1.0542 1.1062 1.0601 1.1926 1.7638 1.0487 6.0389 6.1673 9.5607 1.0366 1.0375 1.0811 1.0313 1.0585 1.0841 1.0993 1.1021 1.0988 1.0995 1.0984 1.1043 1.0874 1.0858 1.0911 1.0960 1.1048 1.1015
irintensity: 0.0872 0.0273 0.0292 1.2469 0.3955 1.2764 0.4891 1.1750 2.7225 3.7852 0.8106 0.6866 2.3165 10.9404 0.4862 0.2678 1.3446 0.0455 2.1147 1.9535 24.8378 4.7817 0.0605 2.6186 4.6072 51.4173 19.9931 35.4446 2.4651 0.6620 0.6350 4.8388 1.9773 4.8352 1.9447 1.4671 1.0410 2.8915 19.7247 45.8761 9.0077 11.0909 26.8234 43.5317 1.6907 7.6268 15.3112 18.7609 23.1151 0.5824 0.3107 31.2716 36.4371 24.4953 3.0157 2.5362 5.6400 0.5298 0.6887 10.4366 8.2241 17.8140 16.6359 5.6545 12.2343 2.7101 10.9273 5.6319 5.2385 16.1794 5.6368 22.3735 1.4798 8.3064 154.1422 29.4237 24.8413 6.8589 42.3333 14.9986 12.4523 6.7769 11.5101 71.6069 42.9494 50.6224 27.2325 10.7725 2.6652 12.9724 45.1519 15.9349 23.5149
temp: 298.150 k
press: 1.00000 atm
elementType: 8 8 6 6 6 6 6 6 6 6 6 6 6 6 6 1 1 1 1 1 1 1 1 1 1 1 1 1 1 1 1 1 1
symmnumber: 1
zpe: 730720.5 jmol-1
zpe.correction: 0.278317 hartree
zpe.thermalcorrener: 0.294583 hartree
zpe.thermalcorrenthalpy: 0.295527 hartree
zpe.thermalcorrgfe: 0.232436 hartree
zpe.sumelectzpe: -655.489626 hartree
zpe.sumelectthermal: -655.473360 hartree
zpe.sumelectthermalent: -655.472415 hartree
zpe.sumelectthermalfe: -655.535506 hartree
dipole: -0.6812 -0.0038 -1.8001
dipole: 1.9247
quadrupole: -84.7617 -80.8297 -96.3547
quadrupole: 2.1955 3.3523 -7.3571
quadrupole: 2.5536 6.4857 -9.0393 2.1955 3.3523 -7.3571
hfenergy: -655.7679427 hartree
pointgroup: C01 [X(C13H18O2)]
dipole: -0.2781218 -0.0143509 -0.7041537 debye
polarizability: 166.2495265|13.4032869|141.1894854|11.2206506|-13.8133426|114.1839503 unknown
InChI: InChI=1S/C13H18O2/c1-10(2)12(13(14)15-3)9-11-7-5-4-6-8-11/h4-8,10,12H,9H2,1-3H3
charge 0 multiplicity 1
33 atoms
O  -1.335108 1.678737 -0.572833
O  -1.001512 1.314237 1.700197
C  -1.247844 -0.622482 0.164791
C  -2.699946 -0.992849 -0.29646
C  -0.170028 -0.965518 -0.914064
C  -2.837115 -2.509237 -0.574663
C  -3.749455 -0.552459 0.753158
C  1.246748 -0.5894 -0.500087
C  -1.169637 0.852559 0.549976
C  1.877054 0.566937 -1.026483
C  1.96318 -1.383452 0.433221
C  3.187382 0.922308 -0.632402
C  3.27136 -1.031512 0.832054
C  3.889215 0.12456 0.299831
C  -1.263654 3.134824 -0.306437
H  -1.022449 -1.180217 1.094956
H  -2.895082 -0.440115 -1.238058
H  -0.444234 -0.448419 -1.85158
H  -0.218764 -2.053195 -1.104843
H  -2.200046 -2.846985 -1.41083
H  -2.569981 -3.100536 0.322704
H  -3.882955 -2.753685 -0.836906
H  -4.767514 -0.820394 0.415795
H  -3.729371 0.538211 0.927929
H  -3.570284 -1.050316 1.725112
H  1.33444 1.187454 -1.75004
H  1.494029 -2.28587 0.846283
H  3.660359 1.817177 -1.053219
H  3.809841 -1.657125 1.553145
H  4.905235 0.397525 0.606529
H  -0.276384 3.395974 0.110734
H  -2.046405 3.43264 0.41166
H  -1.421777 3.609622 -1.285169
