program: Gaussian 09
title: 000141426
version: EM64L-G09RevD.01
frameworkgroup: C1[X(C8H18NO2P)]
method: RPBEPBE
basis: SDD
operation: Freq
keyword: #p
keyword: freq=noraman
keyword: PBEPBE/SDD
title: #p freq=noraman PBEPBE/SDD
converged: YES YES NO NO
title: Mulliken charges:
elementType: P O O N C C C C C C C C H H H H H H H H H H H H H H H H H H
charge: 0.971102 -0.503975 -0.513682 -0.568600 -0.024069 0.014472 -0.642593 -0.700823 -0.666102 -0.709066 -0.283951 -0.327832 0.217836 0.207182 0.205393 0.221295 0.218938 0.232077 0.214221 0.227990 0.199782 0.255301 0.207944 0.243445 0.206400 0.233579 0.215980 0.206319 0.226843 0.214594
chargesum: 0.00000
title: Mulliken charges with hydrogens summed into heavy atoms:
elementType: P O O N C C C C C C C C
charge: 0.971102 -0.503975 -0.513682 -0.568600 0.193767 0.221654 0.003034 -0.026535 -0.003075 -0.025643 0.138348 0.113605
polarizability: 1.52104251e+02 -2.44713530e+00 1.16082505e+02 1.13006455e+00 4.00001441e-01 1.04200835e+02
1716.lowfreq: -19.5226 -12.8188 -9.7258 0.0015 0.0019 0.0021 33.2791 53.9977 73.7342
frequency: 32.5334 53.8855 73.6866 102.6133 131.5223 159.4651 177.8926 187.1125 222.6469 232.6515 241.0936 249.8517 275.8980 278.2316 300.8361 351.7344 385.0310 457.2320 469.8812 482.3293 505.1915 538.9159 585.2389 602.2930 609.6829 833.8487 845.5714 873.3536 879.6990 914.8607 923.7865 927.2829 938.8851 958.5541 977.3462 993.3783 1019.7524 1094.1697 1104.5087 1136.0079 1141.4502 1168.3296 1177.2986 1186.5255 1189.5036 1198.3971 1307.3149 1313.3955 1315.8367 1322.1769 1332.5340 1372.9261 1376.1956 1389.3028 1392.9572 1396.3032 1455.0515 1460.7740 1461.6350 1463.3597 1467.4426 1471.2923 1474.7542 1478.9476 1485.0583 1501.6016 2958.4645 2972.7479 2975.5107 2975.7749 2976.8833 2984.1910 2991.3580 2992.9516 3059.3681 3067.6993 3073.0221 3079.3117 3080.2786 3082.1535 3085.5947 3091.0165 3099.2526 3111.3817
redmass: 3.0824 3.9046 2.7139 3.6059 3.2571 4.4469 4.2448 2.3886 1.3981 1.2436 1.4349 1.9350 1.1762 1.2468 2.5680 2.9953 2.3077 4.4122 3.1623 6.2240 6.5958 3.1788 3.7092 3.0274 7.2130 3.1008 1.9304 2.6035 2.9313 1.2382 1.2598 1.3993 1.4993 1.9069 3.9324 4.9300 2.7264 1.5671 1.7290 2.2384 2.2731 1.1334 2.3580 1.2220 2.4868 2.2331 1.3753 1.2697 1.3116 1.1896 1.2000 1.2154 1.2108 1.2102 1.2121 1.2372 1.0451 1.0466 1.0823 1.0524 1.0642 1.0535 1.0477 1.0578 1.0507 1.0550 1.0832 1.0778 1.0578 1.0386 1.0459 1.0365 1.0420 1.0541 1.1018 1.0994 1.0997 1.1033 1.0993 1.1002 1.0988 1.1000 1.1006 1.1003
irintensity: 0.0802 0.8262 0.0237 4.0542 3.4532 11.9032 0.7057 0.7145 0.9842 0.2473 1.5864 1.6172 0.7053 0.7814 1.4951 3.8664 0.4304 6.7819 13.4544 23.2791 46.7229 1.6930 18.1957 38.6648 106.2456 6.0420 6.2144 55.0812 30.7049 2.0684 4.2863 23.2091 2.3715 34.3589 23.7645 85.0043 23.1872 6.8616 35.1288 3.8260 22.7297 3.4308 77.1900 8.4254 82.5850 13.9073 8.0986 5.7884 2.6519 4.4364 16.2036 12.4981 38.9557 7.3821 26.0932 6.6028 3.8256 1.0229 4.5281 3.0194 9.4294 9.7763 13.2841 3.2798 12.9353 10.9814 24.2056 17.3903 112.7669 18.7454 26.8887 22.7473 4.2420 89.0840 50.0598 35.8290 10.9643 46.2871 47.8763 48.4044 30.2498 33.0833 21.5167 25.4081
temp: 298.150 k
press: 1.00000 atm
elementType: 15 8 8 7 6 6 6 6 6 6 6 6 1 1 1 1 1 1 1 1 1 1 1 1 1 1 1 1 1 1
symmnumber: 1
zpe: 670421.8 jmol-1
zpe.correction: 0.255350 hartree
zpe.thermalcorrener: 0.270478 hartree
zpe.thermalcorrenthalpy: 0.271422 hartree
zpe.thermalcorrgfe: 0.213521 hartree
zpe.sumelectzpe: -861.068584 hartree
zpe.sumelectthermal: -861.053457 hartree
zpe.sumelectthermalent: -861.052512 hartree
zpe.sumelectthermalfe: -861.110413 hartree
dipole: -0.5484 1.2617 0.0561
dipole: 1.3769
quadrupole: -68.8140 -82.1700 -87.8312
quadrupole: 0.5314 -0.1762 3.5566
quadrupole: 10.7910 -2.5649 -8.2262 0.5314 -0.1762 3.5566
hfenergy: -861.3239344 hartree
pointgroup: C01 [X(C8H18N1O2P1)]
dipole: -0.4282582 -0.3024651 -0.1362853 debye
polarizability: 145.6197389|-11.170157|117.902558|-8.691838|7.9089025|108.8652944 unknown
InChI: InChI=1S/C8H18NO2P/c1-7(2)9(8(3)4)12-10-5-6-11-12/h7-8H,5-6H2,1-4H3
charge 0 multiplicity 1
30 atoms
P  0.879973 0.677882 0.514384
O  1.851815 0.836704 -1.043759
O  1.514302 -1.024668 0.698845
N  -0.792252 0.323252 0.163271
C  -1.826627 1.288504 0.686144
C  -1.382176 -0.800691 -0.637866
C  -2.158152 2.370997 -0.370521
C  -1.46371 1.929099 2.044599
C  -1.707365 -2.0008 0.28585
C  -0.531558 -1.239559 -1.846504
C  2.709516 -0.33137 -1.307403
C  2.818613 -1.129287 0.020837
H  -2.73341 0.672039 0.855233
H  -2.33468 -0.399826 -1.043794
H  -3.014436 2.991406 -0.045025
H  -1.285438 3.031703 -0.52374
H  -2.413623 1.914399 -1.343731
H  -1.190531 1.158509 2.787284
H  -2.338771 2.487542 2.425139
H  -0.622625 2.639012 1.958402
H  -2.228713 -2.79689 -0.279208
H  -0.769797 -2.406733 0.701802
H  -2.356841 -1.693741 1.126258
H  -0.193129 -0.36917 -2.434257
H  -1.138085 -1.897288 -2.495642
H  0.348924 -1.812059 -1.513918
H  3.694762 0.041718 -1.638238
H  2.261932 -0.94704 -2.110227
H  3.006649 -2.20333 -0.145174
H  3.614235 -0.707813 0.668059
