program: Gaussian 09
title: 000141368
version: EM64L-G09RevD.01
frameworkgroup: C1[X(C16H17N3O3)]
method: RPBEPBE
basis: SDD
operation: Freq
keyword: #p
keyword: freq=noraman
keyword: PBEPBE/SDD
title: #p freq=noraman PBEPBE/SDD
converged: YES YES NO NO
title: Mulliken charges:
elementType: O O O N N N C C C C C C C C C C C C C C C C H H H H H H H H H H H H H H H H H
charge: -0.260608 -0.259591 -0.251806 -0.198498 -0.214358 -0.208787 -0.557334 0.281549 0.265246 0.260519 0.492691 -0.414727 -0.415820 -0.380634 -0.383131 -0.023820 -0.025937 -0.231553 -0.233103 -0.234165 -0.549893 -0.549891 0.251834 0.252052 0.253216 0.239917 0.253139 0.240011 0.264043 0.264649 0.250486 0.249921 0.226631 0.226648 0.229195 0.218768 0.226406 0.218891 0.227845
chargesum: 0.00000
title: Mulliken charges with hydrogens summed into heavy atoms:
elementType: O O O N N N C C C C C C C C C C C C C C C C
charge: -0.260608 -0.259591 -0.251806 -0.198498 -0.214358 -0.208787 -0.053447 0.281549 0.265246 0.260519 0.492691 0.078405 0.077330 -0.116591 -0.118482 0.226666 0.223984 -0.004922 -0.006456 -0.004970 -0.104718 -0.103155
polarizability: 2.08073484e+02 -8.27041247e+00 2.14443407e+02 -5.66420407e+00 7.06546211e-01 1.56648761e+02
1716.lowfreq: -6.1992 -0.0004 -0.0002 0.0005 3.4325 6.0010 22.9190 24.5578 34.1939
frequency: 22.8610 24.4972 34.1205 34.5015 51.2243 57.0696 67.7468 85.8777 89.9613 110.7283 163.4788 171.0487 199.0089 216.9234 278.0467 285.5571 314.7801 353.0994 355.4500 386.4259 395.2928 404.7881 405.7185 419.0612 429.4246 447.3530 477.6719 494.2128 540.9328 608.3499 617.6366 646.3122 665.8402 700.6182 707.2627 707.8969 708.9809 720.1362 750.0951 772.4159 822.1405 862.1475 865.7928 878.6155 919.9812 922.2259 939.4565 949.4986 960.3127 964.4893 966.4707 977.9559 986.4022 990.3936 1000.8530 1008.8340 1010.3294 1028.0085 1078.4320 1082.5742 1093.0362 1125.5998 1173.7506 1181.1244 1183.8296 1190.9357 1198.3160 1216.4815 1281.6612 1284.0567 1288.7280 1295.6839 1313.6550 1334.7731 1343.9727 1345.5114 1355.2646 1383.4433 1394.0138 1397.8524 1427.8601 1430.0382 1444.2029 1444.5472 1446.2877 1457.9003 1484.9469 1593.6094 1601.7465 1606.2142 1613.9522 1661.2330 1661.5824 1665.0341 3038.3843 3039.2878 3054.3824 3092.5345 3092.6420 3108.5777 3108.6533 3116.7171 3124.1680 3125.2910 3125.4043 3132.5612 3143.5594 3152.3837 3165.3252 3202.9819 3203.1387
redmass: 4.3475 4.3957 3.4952 4.7670 4.0135 5.6947 3.7295 4.2869 4.4044 3.9940 6.2333 2.9965 4.8163 4.7107 3.5336 4.4718 4.2775 4.9313 5.0175 2.1619 2.5176 2.3710 2.7975 4.8161 4.7445 5.2040 2.6701 2.8372 3.2265 4.4637 6.2452 4.9570 2.1948 5.1355 3.4865 6.7441 2.4043 4.8979 2.9581 2.9360 3.5224 1.2540 1.9445 2.1692 1.7802 2.0652 1.5309 2.2445 1.9864 1.3816 1.6538 3.0118 1.3852 5.7004 1.3386 1.1571 1.1565 2.2519 1.9116 2.3464 2.5691 2.2804 1.0546 2.7078 2.6624 1.1448 6.2603 3.3198 1.2905 1.2568 1.7311 1.6449 1.4613 1.3576 1.3248 1.2992 1.3544 5.7919 2.9383 2.6046 1.1845 1.2327 1.1383 1.7315 1.2877 1.1391 2.1955 6.3236 9.8699 10.6497 5.9944 4.8267 4.6565 9.0713 1.0609 1.0607 1.0589 1.0602 1.0602 1.0985 1.0983 1.1057 1.0847 1.0993 1.0992 1.0881 1.0927 1.0967 1.1016 1.1149 1.1150
irintensity: 0.0504 0.0783 0.0345 0.5245 0.0757 0.4545 0.2480 0.1875 0.0838 2.7920 10.5627 0.3898 0.5838 0.5564 0.7401 1.0497 5.9368 22.3905 29.1088 2.8089 4.3908 2.2300 0.3953 6.4616 4.7019 0.0837 10.6445 20.1792 15.7129 27.7235 0.0843 7.3836 35.1339 8.2560 4.8621 11.2768 50.7324 8.0661 59.0224 19.5470 9.0345 1.2504 9.7266 12.6375 14.3630 8.7294 8.1027 7.8676 51.9942 51.9979 54.5204 2.1529 0.8925 0.0386 1.2391 26.5699 20.0938 6.9736 3.0364 14.7916 4.0511 3.3965 0.0158 3.3175 9.1951 3.3587 4.6241 21.3542 20.1889 10.8271 108.2018 105.5952 16.0832 45.3502 21.3926 5.6837 45.8435 42.2937 200.3904 279.3247 30.8301 23.3565 58.8059 57.6348 80.6106 73.2287 24.9336 78.0555 475.7593 608.4863 1.8339 2.3567 4.1053 3.5877 13.1207 14.6935 14.7310 5.6277 6.3043 1.8450 1.9446 0.0437 0.0665 3.6263 3.8749 5.0697 15.2779 21.5898 20.6867 14.9148 21.1355
temp: 298.150 k
press: 1.00000 atm
elementType: 8 8 8 7 7 7 6 6 6 6 6 6 6 6 6 6 6 6 6 6 6 6 1 1 1 1 1 1 1 1 1 1 1 1 1 1 1 1 1
symmnumber: 1
zpe: 802001.4 jmol-1
zpe.correction: 0.305466 hartree
zpe.thermalcorrener: 0.326089 hartree
zpe.thermalcorrenthalpy: 0.327033 hartree
zpe.thermalcorrgfe: 0.252820 hartree
zpe.sumelectzpe: -1008.252049 hartree
zpe.sumelectthermal: -1008.231426 hartree
zpe.sumelectthermalent: -1008.230482 hartree
zpe.sumelectthermalfe: -1008.304695 hartree
dipole: -0.1835 0.0505 0.6982
dipole: 0.7237
quadrupole: -130.0904 -126.9160 -122.6040
quadrupole: -1.0751 -5.6843 -0.8140
quadrupole: -3.5536 -0.3792 3.9328 -1.0751 -5.6843 -0.8140
hfenergy: -1008.5575151 hartree
pointgroup: C01 [X(C16H17N3O3)]
dipole: -0.0748969 -0.0218418 -0.2738257 debye
polarizability: 208.5204322|8.469741|214.0918009|5.1348614|-0.2220621|156.5534184 unknown
InChI: InChI=1S/C16H17N3O3/c1-3-10-17-14(20)18(11-4-2)16(22)19(15(17)21)12-13-8-6-5-7-9-13/h3-9H,1-2,10-12H2
charge 0 multiplicity 1
39 atoms
O  -0.329434 -2.301406 1.25995
O  -0.093982 2.376786 1.200401
O  3.594098 -0.172913 -0.151934
N  -0.238368 0.038727 1.236418
N  1.644015 -1.256482 0.551062
N  1.766469 1.125547 0.535315
C  -1.661287 0.117651 1.706164
C  0.313958 -1.245004 1.026883
C  0.44028 1.252986 1.001153
C  2.413323 -0.103892 0.278085
C  -2.664623 0.183515 0.560106
C  2.275436 -2.585403 0.273395
C  2.517377 2.385458 0.235455
C  -3.197977 -1.008156 0.005312
C  -3.084543 1.437514 0.047381
C  2.134537 -2.985569 -1.183112
C  2.201084 2.915569 -1.150499
C  -4.135617 -0.945569 -1.049683
C  -4.023114 1.498882 -1.006946
C  -4.551124 0.307678 -1.557448
C  1.437143 -4.07053 -1.598373
C  3.11509 2.997926 -2.147458
H  -1.723344 1.019506 2.335407
H  -1.82608 -0.780313 2.322179
H  3.340247 -2.488728 0.54629
H  1.782712 -3.316211 0.932662
H  2.222917 3.116997 1.007197
H  3.587969 2.148125 0.330637
H  -2.86934 -1.976891 0.398855
H  -2.664879 2.356441 0.472146
H  2.657371 -2.345707 -1.907001
H  1.168796 3.256692 -1.308011
H  -4.544244 -1.870437 -1.471993
H  -4.344566 2.471713 -1.395602
H  -5.281438 0.355564 -2.373199
H  1.375699 -4.338934 -2.658998
H  0.904797 -4.716537 -0.889792
H  2.853561 3.405034 -3.130636
H  4.147682 2.655571 -2.008767
