program: Gaussian 09
title: 000141366
version: EM64L-G09RevD.01
frameworkgroup: C1[X(C6H5N)]
method: RPBEPBE
basis: SDD
operation: Freq
keyword: #p
keyword: freq=noraman
keyword: PBEPBE/SDD
title: #p freq=noraman PBEPBE/SDD
converged: NO NO NO NO
title: Mulliken charges:
elementType: N C C C C C C H H H H H
charge: -0.036639 -0.557449 0.340980 -0.217369 -0.356013 -0.217635 -0.241369 0.259061 0.259058 0.246771 0.270498 0.250105
chargesum: 0.00000
title: Mulliken charges with hydrogens summed into heavy atoms:
elementType: N C C C C C C
charge: -0.036639 -0.039329 0.340980 0.029402 -0.085515 0.032470 -0.241369
polarizability: 1.05268846e+02 2.22726562e+00 6.40832887e+01 -5.13441599e-03 -1.29719619e-03 3.13681684e+01
1716.lowfreq: -0.0007 -0.0003 0.0006 13.0107 13.7515 18.7770 162.4047 171.8186 345.6315
frequency: 162.4007 171.8153 345.6300 497.5016 527.1152 535.9941 550.4862 706.2030 809.9787 873.3227 896.1246 905.9837 953.1459 967.9542 1022.5153 1094.0685 1103.0639 1177.5563 1239.9584 1280.5049 1353.7378 1389.5784 1503.4439 1578.3410 2154.8856 2989.2510 3035.9900 3172.7662 3186.2572 3207.5420
redmass: 5.0095 5.8088 1.7492 3.7932 7.8139 3.0604 7.5557 1.2210 5.9420 3.9836 2.1973 1.3284 1.3547 1.8203 1.7296 1.1286 1.1811 2.5832 1.4722 3.4938 2.0731 1.1268 6.1877 5.5718 12.6039 1.0616 1.0971 1.0882 1.0966 1.1084
irintensity: 1.8983 3.2404 11.0313 4.5903 2.7060 6.6100 0.1354 71.5370 9.3613 3.0703 6.9593 22.6590 0.0100 18.8168 17.4640 0.6073 0.7521 9.3911 0.0288 6.8174 5.3662 40.6080 13.7605 0.0345 64.7375 1.0720 3.5804 4.1364 6.0541 8.2873
temp: 298.150 k
press: 1.00000 atm
elementType: 7 6 6 6 6 6 6 1 1 1 1 1
symmnumber: 1
zpe: 235623.2 jmol-1
zpe.correction: 0.089744 hartree
zpe.thermalcorrener: 0.095583 hartree
zpe.thermalcorrenthalpy: 0.096527 hartree
zpe.thermalcorrgfe: 0.060177 hartree
zpe.sumelectzpe: -285.856505 hartree
zpe.sumelectthermal: -285.850666 hartree
zpe.sumelectthermalent: -285.849722 hartree
zpe.sumelectthermalfe: -285.886072 hartree
dipole: 4.6584 -0.4585 -0.0002
dipole: 4.6809
quadrupole: -51.5381 -34.2899 -42.2205
quadrupole: -0.3050 0.0013 -0.0001
quadrupole: -8.8553 8.3929 0.4623 -0.3050 0.0013 -0.0001
hfenergy: -285.946249 hartree
pointgroup: C01 [X(C6H5N1)]
dipole: 1.8354407 -0.150695 -0.0000923 debye
dipolederiv: -0.5758002 -0.0105803 0.0000053 -0.030746 -0.2346679 0.000001 0.0000292 -0.000001 -0.2583794 -0.0648965 -0.1146096 0.0000177 -0.0690756 -0.2661741 0.0000291 0.0000123 0.0000449 0.16003 -0.4102396 -0.005715 0.0000239 -0.2063406 0.293254 -0.000005 -0.0000049 -0.0000237 -0.0097851 -0.1504856 0.0973755 0.0000044 0.0063086 0.146475 -0.000027 0.0000134 -0.0000358 -0.2273452 0.2746732 -0.1753763 -0.0000142 -0.0854865 0.0629602 0.0000102 0.0000047 0.0000185 -0.1236896 0.0598364 0.145293 -0.0000061 0.2830259 -0.1589565 -0.0000057 -0.0000181 0.0000016 -0.1838168 0.6446754 0.0552414 -0.0000365 0.0899802 -0.0863354 -0.0000024 -0.0000361 0.0000051 0.0314247 0.1059727 -0.0165034 -0.0283205 -0.0103321 0.0857535 -0.08535 -0.0225429 -0.100356 0.0261236 0.1059812 -0.0164909 0.028311 -0.0103235 0.0857713 0.0853426 0.022539 0.1003437 0.0260948 -0.0320117 0.0646544 0.0000026 0.066761 0.0615201 0.000006 -0.0000019 0.0000098 0.1763708 0.0753732 0.060403 0.0000049 0.0582711 -0.0242423 -0.0000031 0.0000051 -0.0000093 0.1905475 -0.0330785 -0.0836918 0.0000077 -0.0920427 0.0346422 0.0000043 0. 0.0000022 0.1924249 unknown
polarizability: 105.1859541|2.8927104|64.1661802|-0.0051127|-0.0013801|31.3681684 unknown
InChI: InChI=1S/C6H5N/c7-5-6-3-1-2-4-6/h1-3H,4H2
charge 0 multiplicity 1
12 atoms
N  -2.930003 -0.087004 0.000229
C  0.584854 -1.205933 -0.000037
C  -0.310053 0.02699 -0.000048
C  1.979808 -0.619504 -0.000111
C  0.488544 1.159291 -0.000118
C  1.900329 0.755591 -0.000158
C  -1.731478 -0.020528 0.000078
H  0.400708 -1.844589 -0.887495
H  0.400814 -1.844484 0.887523
H  2.889259 -1.225096 -0.000091
H  0.126129 2.190319 -0.000091
H  2.74019 1.454146 -0.000181
