program: Gaussian 09
title: 000141346
version: EM64L-G09RevD.01
frameworkgroup: C1[X(C10H12)]
method: RPBEPBE
basis: SDD
operation: Freq
keyword: #p
keyword: freq=noraman
keyword: PBEPBE/SDD
title: #p freq=noraman PBEPBE/SDD
converged: NO YES NO NO
title: Mulliken charges:
elementType: C C C C C C C C C C H H H H H H H H H H H H
charge: -0.212218 -0.212247 -0.212218 -0.212245 -0.196508 -0.196443 -0.530057 -0.530058 -0.263770 -0.263781 0.239881 0.239880 0.239882 0.239879 0.231171 0.231176 0.232218 0.238613 0.238613 0.232220 0.232999 0.233014
chargesum: 0.00000
title: Mulliken charges with hydrogens summed into heavy atoms:
elementType: C C C C C C C C C C
charge: 0.027663 0.027633 0.027664 0.027634 0.034663 0.034732 -0.059226 -0.059225 -0.030771 -0.030767
polarizability: 9.90442127e+01 -8.82669147e-08 8.50497166e+01 -2.53598234e-05 2.98989125e-03 8.98431307e+01
1716.lowfreq: -0.0005 -0.0003 -0.0002 20.2619 30.2586 32.8380 267.5615 286.1117 298.1292
frequency: 267.5615 286.1070 298.1275 338.5898 433.1171 479.4240 494.4101 596.7421 620.5676 633.1411 715.0937 718.3582 758.9360 785.4130 790.9565 817.0260 856.1690 887.8970 908.5816 934.6931 942.2518 946.8500 966.8527 1008.0596 1019.5937 1042.3567 1052.6607 1054.8969 1059.1430 1080.8863 1085.6097 1086.5736 1104.9256 1125.8340 1174.0397 1189.3280 1200.6594 1219.1684 1257.0581 1269.2837 1272.1185 1296.1467 1324.7970 1366.2182 1368.3857 1436.9123 1446.2893 1624.7094 3040.1601 3043.9337 3089.9340 3090.6577 3107.7413 3110.8367 3123.4144 3126.5443 3128.8999 3158.9367 3194.1848 3195.0506
redmass: 2.8237 3.1973 2.7223 2.3697 4.0908 3.5688 2.2459 4.3948 4.5555 2.6222 2.0808 1.7294 2.8027 1.8815 2.1368 1.9854 1.5912 3.1322 1.9427 2.7008 2.8568 1.3631 2.2135 1.3612 2.5705 2.6707 1.2996 1.1866 1.2909 1.2662 1.3501 1.2901 1.5850 1.1052 1.5544 1.4075 1.4634 1.3450 2.4874 1.6468 1.4426 1.2860 2.0672 1.8102 1.7194 1.2113 1.3124 5.9868 1.0869 1.0877 1.0566 1.0564 1.0881 1.0881 1.0948 1.0866 1.0954 1.1052 1.1136 1.1134
irintensity: 0.2531 0.0534 0.0000 7.2360 0.0000 0.7192 0.5151 9.6772 0.8120 0.0000 17.0518 32.8099 0.0000 22.1217 0.9616 5.2321 34.0461 13.3115 3.0579 1.9871 2.4252 0.0000 0.3189 0.0000 0.0000 10.0240 0.1967 0.0000 35.0647 0.0000 0.0105 4.7785 2.6199 0.0139 0.5720 0.9737 0.3250 0.0000 11.4041 8.0358 0.0000 1.9621 0.1426 5.6555 0.6566 22.0395 2.7016 0.6517 70.7574 0.8343 47.1505 3.6303 0.0002 35.6977 14.8907 13.0532 48.2990 23.2845 5.2807 21.4368
temp: 298.150 k
press: 1.00000 atm
elementType: 6 6 6 6 6 6 6 6 6 6 1 1 1 1 1 1 1 1 1 1 1 1
symmnumber: 1
zpe: 496766.1 jmol-1
zpe.correction: 0.189208 hartree
zpe.thermalcorrener: 0.196309 hartree
zpe.thermalcorrenthalpy: 0.197253 hartree
zpe.thermalcorrgfe: 0.158341 hartree
zpe.sumelectzpe: -387.422637 hartree
zpe.sumelectthermal: -387.415537 hartree
zpe.sumelectthermalent: -387.414593 hartree
zpe.sumelectthermalfe: -387.453505 hartree
dipole: 0.0000 -0.4405 0.0003
dipole: 0.4405
quadrupole: -61.6490 -56.1850 -58.7169
quadrupole: 0.0000 0.0000 -0.0018
quadrupole: -2.7987 2.6653 0.1334 0.0000 0.0000 -0.0018
hfenergy: -387.6118454 hartree
pointgroup: C01 [X(C10H12)]
dipole: -0.000003 0.1732977 -0.0014817 debye
dipolederiv: 0.0839915 -0.0405393 0.0463176 -0.0375924 0.0811598 -0.0085258 0.0544801 0.0440407 -0.1662886 0.0839921 -0.0413504 -0.0456033 -0.038527 0.0804743 0.0043183 -0.0538129 -0.0482463 -0.1656182 0.0839924 0.0405385 -0.0463105 0.0375929 0.0811587 -0.0085259 -0.0544769 0.0440407 -0.1662906 0.0839861 0.0413481 0.0456089 0.0385278 0.0804783 0.0043218 0.0538243 -0.0482425 -0.1656109 0.1047081 -0.0000012 -0.0000029 -0.000001 -0.0723769 0.0835664 -0.0000027 0.0067867 0.2677324 0.1047155 0.0000009 -0.0000002 0.0000006 -0.0738632 -0.0777256 -0.000001 -0.0009885 0.2692039 -0.252709 -0.104457 0.0008733 -0.0560503 0.0123194 -0.0000165 0.0004614 -0.0000251 0.0105583 -0.252714 0.1044538 -0.0008822 0.0560438 0.0123193 -0.0000164 -0.0004685 -0.0000243 0.0105555 -0.239283 -0.0000041 -0.0000038 -0.0000038 0.1454305 0.0133854 -0.0000039 -0.0398907 -0.0163419 -0.2392799 -0.0000022 -0.0000066 -0.000002 0.1458407 -0.0161515 -0.0000036 0.0370968 -0.0167352 0.0353094 0.047142 0.0216296 0.0616507 -0.0804974 0.1240528 0.0158446 0.0762978 0.0147521 0.0353051 0.0467945 -0.0224144 0.0613916 -0.083873 -0.1223678 -0.0169077 -0.0745911 0.0181548 0.0353131 -0.0471418 -0.0216311 -0.0616524 -0.080497 0.1240505 -0.0158436 0.0762974 0.0147502 0.0353069 -0.046786 0.0224191 -0.0613847 -0.083877 -0.1223701 0.0169078 -0.0745955 0.018154 0.037274 0.0000004 0.0000048 0.0000007 0.0543955 -0.0298392 0.0000039 -0.0153629 -0.1962439 0.0372784 0. 0.0000017 -0.0000002 0.0551013 0.0255369 0.0000024 0.0110645 -0.1969847 -0.1491992 0.0619242 -0.0005335 0.1032883 0.0293885 0.0008857 -0.0008811 0.0008841 0.1332033 0.08666 -0.0091765 0.0000828 -0.0880842 -0.0774965 0.0013268 0.000756 0.0013267 0.0786477 0.0866611 0.0091775 -0.000082 0.0880871 -0.077493 0.0013304 -0.0007571 0.001329 0.0786471 -0.1491952 -0.0619262 0.0005262 -0.1032903 0.0293873 0.0008835 0.000874 0.0008834 0.1332047 0.1739403 0.0000048 0.0000032 0.0000038 -0.0902 -0.0787943 0.000003 -0.0885321 0.0227265 0.1739463 0. 0.0000033 0.0000011 -0.0872795 0.0806747 0.0000017 0.0904512 0.0198236 unknown
polarizability: 99.0442127|0.0000931|85.0500675|0.0001562|0.0411211|89.8427797 unknown
InChI: InChI=1S/C10H12/c1-2-6-9-3-7(9)5(1)8-4-10(6)8/h1-2,5-10H,3-4H2
charge 0 multiplicity 1
22 atoms
C  -1.223677 0.7402 -0.775023
C  -1.223741 0.753291 0.762295
C  1.223689 0.740218 -0.774988
C  1.223711 0.753312 0.762324
C  0.000018 -0.075192 -1.307876
C  -0.000015 -0.052892 1.308937
C  -2.383207 0.089158 -0.000819
C  2.383207 0.089195 -0.000752
C  0.000022 -1.453061 -0.668939
C  0.000008 -1.441369 0.693773
H  -1.42988 1.668414 -1.31994
H  -1.430088 1.690669 1.29125
H  1.42989 1.668429 -1.319908
H  1.43001 1.690696 1.291293
H  0.000037 -0.125794 -2.409975
H  -0.000027 -0.084589 2.411747
H  -3.342576 0.618308 -0.005345
H  -2.465781 -1.001138 0.008467
H  2.465789 -1.001099 0.008546
H  3.342567 0.618358 -0.005256
H  0.00004 -2.366252 -1.273818
H  0.000004 -2.344061 1.314206
