program: Gaussian 09
title: 000141343
version: EM64L-G09RevD.01
frameworkgroup: C1[X(C10H13NO2)]
method: RPBEPBE
basis: SDD
operation: Freq
keyword: #p
keyword: freq=noraman
keyword: PBEPBE/SDD
title: #p freq=noraman PBEPBE/SDD
converged: YES YES NO NO
title: Mulliken charges:
elementType: O O N C C C C C C C C C C H H H H H H H H H H H H H
charge: -0.243747 -0.446426 -0.198970 -0.355360 -0.364248 -0.308314 -0.320973 0.518097 -0.513183 -0.408735 0.312158 -0.193051 -0.436560 0.221430 0.214990 0.219823 0.215685 0.194654 0.217966 0.219652 0.193046 0.241167 0.230573 0.218304 0.219612 0.352411
chargesum: 0.00000
title: Mulliken charges with hydrogens summed into heavy atoms:
elementType: O O N C C C C C C C C C C
charge: -0.243747 -0.094015 -0.198970 0.081059 0.071261 0.104305 0.091725 0.518097 -0.272016 -0.178161 0.312158 0.025253 -0.216947
polarizability: 1.74873400e+02 -1.72080380e-01 1.24342707e+02 -1.79356335e+00 1.85099102e+00 6.88611648e+01
1716.lowfreq: -17.6574 -11.5338 -3.7467 0.0007 0.0009 0.0009 37.3386 55.7745 127.7832
frequency: 36.9732 55.7171 127.7708 196.5755 222.0045 227.4266 270.9346 295.5448 344.0341 351.6679 382.4600 442.6941 455.7741 474.4745 502.2036 521.6710 604.7468 617.5910 677.5772 693.4670 749.0967 801.5255 824.4005 837.9983 840.6077 847.5047 914.9194 943.9043 955.8008 980.3301 1021.2657 1043.8810 1053.6526 1082.9749 1093.7804 1102.3295 1147.6172 1169.9386 1184.7359 1200.1468 1204.3815 1252.2769 1261.3031 1285.9270 1308.0872 1335.1729 1347.7319 1361.3752 1365.4864 1377.7509 1390.0478 1444.9634 1451.2569 1452.7790 1460.6838 1476.4845 1495.3554 1579.9737 1636.3073 2911.2938 2921.7160 2951.3869 2956.8853 3054.3660 3081.2583 3085.9983 3087.8828 3121.1929 3143.7342 3172.1697 3176.0266 3588.9536
redmass: 3.4384 4.2855 4.2809 3.7590 2.4610 2.8109 4.1348 4.4651 1.1041 4.2653 1.9555 2.9495 2.7957 3.5407 4.5607 6.0983 3.5482 2.7673 1.8243 4.0669 1.5288 4.1556 1.5096 1.8726 3.3606 1.8258 2.4382 1.3087 3.1039 4.8301 2.3249 2.0411 1.9260 4.6351 1.7167 2.1661 1.4157 2.8505 1.1629 1.0878 1.6069 1.5056 1.3970 1.2100 1.3944 1.3081 1.2558 2.1472 1.4676 1.2999 5.1031 1.0837 1.0928 1.0963 1.1259 2.9697 2.7407 6.2405 6.2631 1.0694 1.0713 1.0669 1.0669 1.0911 1.0960 1.0969 1.0900 1.0870 1.0938 1.0915 1.0933 1.0660
irintensity: 0.9194 0.3306 2.8612 13.0754 2.4627 1.1905 8.4603 9.8415 139.0854 12.4029 2.4631 2.3144 2.6678 2.2472 5.2627 3.3200 1.7038 16.0181 35.0733 1.0836 61.1520 15.3861 2.1766 8.5260 10.7534 23.8666 9.1755 0.8766 109.7882 61.8162 6.1617 0.5516 14.0950 46.3516 18.9601 11.9795 231.9288 12.1605 20.4299 1.1849 51.0967 45.4602 47.4001 9.9909 17.4923 2.7456 10.2869 15.7002 12.3844 5.1640 18.5791 3.3877 15.1960 24.4737 30.3737 12.6753 150.2232 88.2052 270.2810 59.3695 72.6850 35.4020 108.3784 25.8914 39.4136 34.4739 22.2599 8.9739 25.9996 15.3027 4.2613 34.8914
temp: 298.150 k
press: 1.00000 atm
elementType: 8 8 7 6 6 6 6 6 6 6 6 6 6 1 1 1 1 1 1 1 1 1 1 1 1 1
symmnumber: 1
zpe: 562471.7 jmol-1
zpe.correction: 0.214234 hartree
zpe.thermalcorrener: 0.225764 hartree
zpe.thermalcorrenthalpy: 0.226708 hartree
zpe.thermalcorrgfe: 0.176337 hartree
zpe.sumelectzpe: -593.051864 hartree
zpe.sumelectthermal: -593.040334 hartree
zpe.sumelectthermalent: -593.039390 hartree
zpe.sumelectthermalfe: -593.089761 hartree
dipole: 1.1161 1.0871 -0.1451
dipole: 1.5647
quadrupole: -73.4347 -71.7180 -80.6845
quadrupole: 0.7874 1.8825 -0.5632
quadrupole: 1.8444 3.5611 -5.4054 0.7874 1.8825 -0.5632
hfenergy: -593.2660978 hartree
pointgroup: C01 [X(C10H13N1O2)]
dipole: 0.4442493 0.4147484 -0.0979788 debye
dipolederiv: -0.5964268 0.0011747 -0.07774 -0.0162057 -0.7322587 0.1146479 -0.0797475 0.1063754 -0.4662982 -0.7000774 0.5886296 -0.0109139 0.7934156 -0.8825167 -0.0054285 -0.0092598 0.0022185 -0.4270632 -1.6943684 -0.1232623 0.0297866 -0.3456473 -0.4507925 -0.0022942 -0.4137702 -0.0301907 -0.3754131 0.1562502 0.1843802 -0.1680583 0.4460803 0.2911495 -0.0881192 -0.1433716 -0.0896453 0.3933766 0.2551706 -0.2543039 -0.0165626 -0.4964421 0.2835056 0.0769414 -0.011192 0.1078574 0.2673829 0.4151969 -0.1863328 0.0750606 -0.0918641 0.5173701 -0.010752 0.1076169 0.0499306 0.3382969 0.3553472 0.1537754 -0.0492097 0.1449082 0.5012621 -0.089251 0.0607397 -0.1457664 0.4502521 1.7705836 0.1324951 -0.0073463 0.2536892 0.1770444 0.0668038 0.0869796 0.0601234 0.0858035 -0.7399295 0.1504838 0.0117404 0.3068641 -0.0785073 -0.0032732 -0.0441577 0.0041667 -0.2364586 -0.5561351 -0.0279054 -0.0024467 -0.4407834 -0.1621723 0.0107946 0.066012 0.0201462 -0.2660369 0.975539 -0.4166882 -0.0005372 -0.6494053 0.9294338 -0.0002008 0.0005949 -0.0106248 0.085879 0.452823 -0.0760847 0.0035114 -0.0996263 0.1961825 -0.0034079 0.0136665 -0.0050949 -0.1087229 -0.2800769 -0.0352454 0.0086857 0.2818973 -0.4805638 0.0020944 0.011995 -0.006607 -0.2698703 -0.0265168 -0.0613354 0.0430243 -0.0975294 0.0094069 -0.0913073 0.1622819 0.0404536 -0.2040111 0.0351478 0.134259 -0.0130784 0.0747031 -0.0499013 0.0131769 0.0095499 -0.0049978 0.0747892 0.0729496 -0.0941044 0.0689036 -0.0113149 -0.047566 0.0821911 0.048066 0.0733754 0.0080148 -0.0504173 0.0450262 -0.0101724 0.1516107 -0.0298382 -0.0577726 0.0789086 -0.1566886 -0.1481989 0.0305427 0.0855196 0.011312 0.0504877 -0.0078753 -0.0307873 -0.0204015 -0.1482854 -0.1698092 -0.0265149 -0.0757922 0.0423862 -0.0604933 -0.0662434 0.0791355 0.0713802 0.1246719 0.0230385 -0.0752362 0.0974138 -0.0163017 0.1088805 -0.09033 0.0352828 0.0284202 -0.0020098 0.0872967 0.0553436 -0.0482601 0.0702042 -0.0519046 -0.0058542 -0.1034676 -0.0049028 0.0090904 -0.2030305 0.0807204 -0.0748427 -0.0042549 -0.0761672 -0.0418403 -0.0009265 -0.0210644 -0.004037 0.1700599 0.0156092 0.1060185 0.0054457 0.1061112 -0.0245456 -0.0024929 0.0105629 -0.0076899 0.1700335 0.0454223 -0.0735831 0.0006819 -0.091058 -0.1035143 0.000787 -0.0132742 0.0022638 0.1488233 -0.1506083 -0.0013119 -0.0008941 0.0208119 0.0748189 0.0009735 -0.009615 0.0069359 0.1925761 0.1796616 -0.1301233 0.0067734 -0.2110182 0.2741461 0.006652 0.0139824 0.0040283 0.3792899 unknown
polarizability: 174.8944039|-0.7167927|124.0490262|0.0070721|-4.4883683|69.1338414 unknown
InChI: InChI=1S/C10H13NO2/c12-10-3-1-2-9(8-10)11-4-6-13-7-5-11/h1-3,8,12H,4-7H2
charge 0 multiplicity 1
26 atoms
O  -3.870657 -0.275345 0.098385
O  3.476582 -1.857159 0.045571
N  -0.986996 0.052419 -0.023757
C  -1.605628 -1.081858 0.705335
C  -1.885562 1.221008 -0.124264
C  -2.97204 -1.441032 0.100153
C  -3.253825 0.799121 -0.6919
C  0.416196 0.244452 0.02097
C  1.29841 -0.874788 0.035504
C  0.993319 1.55386 0.0123
C  2.692245 -0.685024 0.037998
C  2.393193 1.716736 0.004837
C  3.267497 0.609384 0.019588
H  -1.743455 -0.81482 1.778223
H  -0.951352 -1.966254 0.662607
H  -1.448988 1.963991 -0.814249
H  -2.027487 1.709181 0.867851
H  -2.839681 -1.813015 -0.939114
H  -3.480808 -2.207387 0.707574
H  -3.964411 1.64138 -0.655587
H  -3.128936 0.462367 -1.744239
H  0.933385 -1.904404 0.010715
H  0.361982 2.445262 0.040691
H  2.810333 2.730165 0.003993
H  4.355516 0.74785 0.02316
H  4.438368 -1.628592 0.019057
