program: Gaussian 09
title: 000141334
version: EM64L-G09RevD.01
frameworkgroup: C1[X(C9H11Br)]
method: RPBEPBE
basis: SDD
operation: Freq
keyword: #pfreq=noraman
keyword: PBEPBE/SDD
title: #p freq=noraman PBEPBE/SDD
converged: NO YES NO NO
title: Mulliken charges:
elementType: Br C C C C C C C C C H H H H H H H H H H H
charge: -0.058687 0.548382 0.469007 0.469013 -0.527531 -0.527329 -0.552474 -0.860341 -0.810620 -0.810615 0.238532 0.238533 0.237204 0.283285 0.283279 0.225957 0.235779 0.228447 0.235779 0.228432 0.225970
chargesum: 0.00000
title: Mulliken charges with hydrogens summed into heavy atoms:
elementType: Br C C C C C C C C C
charge: -0.058687 0.548382 0.469007 0.469013 -0.289000 -0.288796 -0.315270 -0.293777 -0.120436 -0.120434
polarizability: 1.54824636e+02 -2.48110240e-03 1.16480469e+02 -1.13576549e+00 -2.72151945e-04 7.40625006e+01
1716.lowfreq: -0.0007 -0.0006 -0.0005 2.8936 5.6738 9.1270 33.6832 48.3103 57.0129
frequency: 33.6417 47.9763 56.9969 75.1607 183.6706 219.2684 219.8808 258.4985 270.6125 444.6769 459.4599 503.0046 515.9003 520.1630 582.0893 617.8462 709.8082 866.3343 873.0716 895.5589 920.1321 939.8654 957.3062 989.5541 1020.0050 1024.8462 1046.5797 1052.6209 1108.5635 1179.7702 1182.2232 1208.2040 1300.0347 1320.9443 1381.4715 1398.1706 1399.1137 1432.0256 1450.4832 1459.3142 1473.4632 1474.2283 1479.8321 1485.6033 1611.0861 1614.6579 2973.8637 2974.3214 3055.7468 3055.9254 3064.7752 3085.8158 3085.9494 3109.2974 3114.5455 3119.3845 3149.6353
redmass: 3.7189 1.0600 1.0173 6.6610 3.6240 3.0443 4.1628 2.2715 2.6767 2.3479 5.3116 4.4590 5.4592 3.2458 4.6341 4.1233 2.0636 1.5592 1.4854 1.3319 1.4076 2.3100 2.8797 6.2598 1.4845 1.8403 1.5401 1.6022 1.1021 1.4931 1.4130 1.1295 1.2273 6.0600 7.0358 1.2228 1.2421 2.0625 2.1895 1.1424 1.0560 1.0585 1.2777 1.3216 5.8419 5.9834 1.0388 1.0388 1.0948 1.0948 1.0573 1.1000 1.0999 1.0913 1.0916 1.0926 1.1112
irintensity: 0.7354 0.1388 0.7309 1.8661 4.0188 0.0021 3.7168 1.5173 0.0601 0.0108 35.0842 0.4081 28.8248 0.0914 33.8804 3.6109 23.0872 0.9735 21.9322 0.0379 1.3711 5.0886 3.7018 0.7886 2.3948 0.1099 5.1812 27.7577 1.6395 30.9709 0.0755 40.6871 0.1543 28.9980 0.9135 19.0028 7.6348 4.8331 1.4508 7.0214 1.7711 23.9600 16.8434 16.5786 1.0303 31.6153 44.4372 21.2829 2.5188 39.0520 17.8289 8.0222 20.9524 25.2766 17.9961 0.6199 4.3477
temp: 298.150 k
press: 1.00000 atm
elementType: 35 6 6 6 6 6 6 6 6 6 1 1 1 1 1 1 1 1 1 1 1
symmnumber: 1
zpe: 448916.5 jmol-1
zpe.correction: 0.170983 hartree
zpe.thermalcorrener: 0.181956 hartree
zpe.thermalcorrenthalpy: 0.182900 hartree
zpe.thermalcorrgfe: 0.131513 hartree
zpe.sumelectzpe: -362.288517 hartree
zpe.sumelectthermal: -362.277544 hartree
zpe.sumelectthermalent: -362.276600 hartree
zpe.sumelectthermalfe: -362.327987 hartree
dipole: 3.0709 0.0001 1.3664
dipole: 3.3611
quadrupole: -70.0058 -62.6194 -69.9778
quadrupole: -0.0001 -4.4855 -0.0002
quadrupole: -2.4715 4.9149 -2.4435 -0.0001 -4.4855 -0.0002
hfenergy: -362.4595 hartree
pointgroup: C01 [X(C9H11Br1)]
dipole: 1.1305532 -0.0003115 -0.6859517 debye
dipolederiv: -0.7529146 0.0001619 0.161549 -0.0000353 -0.1538663 0.0000392 0.5752002 -0.0001552 -0.3838369 -0.2262665 0.0001585 0.0346417 0.0002068 0.0842349 -0.0000013 -0.1479675 0.0000766 -0.1036547 0.0744218 -0.2456241 0.0205242 -0.2604726 0.3008782 -0.0019342 -0.0380824 0.0239772 0.0002966 0.0749567 0.2458833 0.0206058 0.2607965 0.3004504 0.0018858 -0.03809 -0.0239579 0.0003203 -0.1060501 -0.2056351 0.0224508 0.0192443 -0.0870535 -0.0380477 0.0422133 -0.0194458 -0.1675133 -0.105816 0.205682 0.0225359 -0.0191387 -0.0872345 0.0380257 0.0421622 0.0194892 -0.1675035 0.0236425 -0.0001852 0.0575059 -0.0000568 -0.2555764 -0.0000317 0.0479108 0.0000234 -0.1744907 1.0812285 -0.0002661 -0.3416213 -0.0003975 0.1044683 0.0001223 -0.5576731 0.0000455 0.5150355 0.0021818 0.1113269 -0.0029343 0.0939002 -0.0966642 0.0103859 0.0393205 -0.0712882 0.0711627 0.0018158 -0.1117335 -0.0030434 -0.0940427 -0.0963377 -0.0103455 0.039339 0.0711505 0.0711705 0.0434263 0.088201 -0.0306583 0.0792815 -0.0577599 0.0109962 -0.0118748 0.0089353 0.130068 0.0432129 -0.0882533 -0.0306431 -0.0794785 -0.0575971 -0.0109484 -0.0119101 -0.0089555 0.1300655 -0.1173738 0.0001009 -0.0502213 0.0000965 0.0884271 0.000022 -0.062582 -0.0000012 0.1277376 -0.0126802 0.0084836 0.0565224 -0.0742492 -0.0104633 -0.0867398 0.0637953 -0.0684333 -0.0441557 -0.0126047 -0.0085289 0.056596 0.0744466 -0.0106465 0.0866099 0.0637896 0.0684503 -0.0440545 -0.0567086 0.0282634 -0.1164024 -0.0398058 0.059972 -0.0407663 -0.1297449 0.0305196 0.015377 0.0494681 0.079083 0.0615122 0.0741175 0.0098432 -0.037407 0.0916134 -0.0806913 -0.0770565 0.0016234 -0.1285202 0.0579504 -0.0358148 -0.0524146 0.0568681 0.0153898 0.0758463 0.0813466 0.0490686 -0.0791949 0.0619062 -0.0741676 0.0100316 0.037155 0.0919568 0.0804563 -0.0769091 0.0016502 0.1287372 0.057703 0.0358847 -0.0525967 -0.0567335 0.0151629 -0.0755253 0.081573 -0.0562821 -0.0281403 -0.1164794 0.0396847 0.059905 0.0408453 -0.1299291 -0.0305166 0.0150216 unknown
polarizability: 153.8196418|-0.007668|116.4804704|-9.0247064|0.0039427|75.0674937 unknown
InChI: InChI=1S/C9H11Br/c1-7-3-8(2)5-9(4-7)6-10/h3-5H,6H2,1-2H3
charge 0 multiplicity 1
21 atoms
Br -3.653697 0.00102 0.964252
C  -1.003525 0.000462 -0.40016
C  1.078889 -1.24058 0.048937
C  1.079821 1.23989 0.049112
C  -0.303554 1.224228 -0.248711
C  -0.304476 -1.223843 -0.248902
C  1.751061 -0.000618 0.198065
C  -2.461803 0.001051 -0.731711
C  1.830224 -2.553468 0.187873
C  1.832179 2.552176 0.188199
H  -0.848292 2.17239 -0.34731
H  -0.849938 -2.171574 -0.347636
H  2.822091 -0.001026 0.442001
H  -2.791624 -0.905545 -1.25886
H  -2.790979 0.908155 -1.258391
H  2.685038 -2.457941 0.88045
H  2.234072 -2.885791 -0.788665
H  1.172425 -3.357841 0.561637
H  2.237934 2.883296 -0.787959
H  1.174552 3.357468 0.560258
H  2.685802 2.456391 0.88222
