program: Gaussian 09
title: 000011277
version: EM64L-G09RevD.01
frameworkgroup: C1[X(C10H8O4S)]
method: RPBEPBE
basis: SDD
operation: Freq
keyword: #p
keyword: freq=noraman
keyword: PBEPBE/SDD
title: #p freq=noraman PBEPBE/SDD
converged: YES YES NO NO
title: Mulliken charges:
elementType: S O O O O C C C C C C C C C C H H H H H H H H
charge: 1.016540 -0.475111 -0.545983 -0.503029 -0.497915 0.295029 0.441989 -0.326069 0.279008 -0.447515 -0.257956 -0.365185 -0.409744 -0.249120 -0.230225 0.255702 0.293488 0.206306 0.251297 0.240093 0.239948 0.388747 0.399703
chargesum: 0.00000
title: Mulliken charges with hydrogens summed into heavy atoms:
elementType: S O O O O C C C C C C C C C C
charge: 1.016540 -0.086364 -0.146280 -0.503029 -0.497915 0.295029 0.441989 -0.326069 0.279008 -0.191813 0.035532 -0.158879 -0.158447 -0.009026 0.009723
polarizability: 2.24044781e+02 9.05843482e+00 1.53438786e+02 -3.57369394e-01 -2.34617372e+00 7.54582859e+01
1716.lowfreq: -9.7993 -0.0018 0.0008 0.0027 1.9856 8.8407 56.9550 62.4158 118.3415
frequency: 56.8947 62.4093 118.3405 134.9048 164.3230 206.0191 220.0993 225.6748 243.3406 276.2623 293.1038 314.1667 345.3826 386.7493 420.5349 426.1846 465.6995 491.0995 508.3318 554.8313 564.5762 582.4316 591.7416 664.0161 706.2795 752.7696 794.9085 804.5351 823.7282 847.8770 862.3479 883.8479 957.6220 963.5822 978.6478 999.7593 1025.3108 1045.4534 1097.8823 1138.3678 1149.8875 1155.1754 1183.4087 1233.6781 1250.9069 1271.5402 1348.5553 1410.2248 1423.8090 1434.1760 1449.6214 1513.6413 1581.7572 1600.8044 1635.7603 3111.5318 3135.1583 3147.9130 3151.5420 3169.1570 3170.6251 3404.3782 3606.6227
redmass: 7.1288 8.4982 3.9837 3.9218 6.1874 3.8470 2.8093 7.0777 2.1150 7.5443 5.2555 7.1715 5.2236 1.7660 3.3421 3.6996 5.5787 5.3249 4.1434 9.6798 3.1531 8.8492 7.4076 4.3339 6.0688 1.3054 2.8821 6.5491 1.3419 12.1334 4.9644 1.7834 1.3531 8.1322 1.3669 1.3689 3.2837 2.7903 2.0062 1.2854 1.6076 1.2654 1.0921 1.7206 1.8002 1.7408 3.2763 2.9479 4.5876 2.5615 3.0011 3.9362 6.6817 6.7720 6.8714 1.0882 1.0878 1.0885 1.0937 1.0975 1.1000 1.0653 1.0661
irintensity: 2.1603 0.5421 12.8195 6.6680 2.8081 11.2157 29.5626 8.6597 50.4214 4.5831 4.3973 17.7977 17.1084 36.4602 48.4248 153.1552 3.9423 23.8426 3.0308 63.0447 15.5451 20.5465 63.3761 18.2457 29.0341 43.4133 11.7664 13.3318 58.8014 105.6151 4.1672 17.9679 1.3169 72.6546 1.4672 0.8585 11.0120 2.7518 110.5260 116.3474 29.8407 5.2546 0.4705 14.8713 66.1823 10.7936 74.6636 0.7136 5.0229 7.1495 0.6227 16.0025 1.0085 19.1682 11.2559 9.3531 0.2469 3.5473 20.3540 3.2232 26.8670 44.9822 44.7462
temp: 298.150 k
press: 1.00000 atm
elementType: 16 8 8 8 8 6 6 6 6 6 6 6 6 6 6 1 1 1 1 1 1 1 1
symmnumber: 1
zpe: 415941.0 jmol-1
zpe.correction: 0.158424 hartree
zpe.thermalcorrener: 0.172088 hartree
zpe.thermalcorrenthalpy: 0.173032 hartree
zpe.thermalcorrgfe: 0.118395 hartree
zpe.sumelectzpe: -1083.569818 hartree
zpe.sumelectthermal: -1083.556154 hartree
zpe.sumelectthermalent: -1083.555210 hartree
zpe.sumelectthermalfe: -1083.609846 hartree
dipole: -9.3607 -1.7667 0.1047
dipole: 9.5266
quadrupole: -104.6891 -77.4916 -104.5516
quadrupole: -1.3313 -0.7142 0.9266
quadrupole: -9.1116 18.0858 -8.9742 -1.3313 -0.7142 0.9266
hfenergy: -1083.7282419 hartree
pointgroup: C01 [X(C10H8O4S1)]
dipole: 3.6582229 -0.8149617 -0.0321293 debye
dipolederiv: 2.2140894 -0.1177115 0.0376613 0.127844 1.2826314 -0.0916618 0.0633389 -0.0912743 1.4851272 -0.3770076 -0.2935915 -0.0544361 -0.3559977 -1.009386 0.1480734 0.0141951 0.2341131 -0.3500553 -0.7017722 -0.0747184 -0.1014113 -0.2775619 -0.5901549 0.3553103 0.0825147 0.2278747 -0.7072939 -0.7286486 0.0634269 -0.0039383 0.0857773 -0.5574693 -0.0279273 0.003732 -0.0669881 -0.4413618 -0.7470608 -0.0006655 -0.0155988 -0.1210977 -0.475404 -0.1238404 -0.1163058 -0.0528035 -0.6116713 -0.0827632 -0.2702806 0.0433706 0.0328407 -0.1437701 0.0172392 0.0203111 0.0540251 0.0072939 0.1879269 -0.1371604 0.0085763 -0.1272662 0.0094103 0.0181513 -0.0110879 0.0185189 0.0740036 -0.2479169 0.2142671 -0.0209724 0.0039836 -0.2518348 0.0042263 -0.073631 -0.0550495 -0.222386 0.1968042 0.3304086 -0.0072488 0.0411556 0.8712716 -0.1230537 0.0082256 -0.1547002 0.0975829 -0.185989 0.1528296 -0.0193896 -0.0443033 0.0480043 -0.0230116 0.0002675 -0.0290488 -0.1724872 -0.1404409 -0.140228 0.0108457 0.3436882 0.037607 -0.0346194 -0.0258748 0.0186339 -0.0815983 -0.1087723 0.0745365 -0.0271225 -0.0689882 0.0318458 -0.0335808 -0.0085763 -0.0424164 -0.1485255 -0.0893627 0.0883939 -0.0157041 0.1456681 0.0962402 -0.0376388 -0.0138025 -0.0397354 -0.1517805 -0.0394155 -0.1197242 0.0185128 -0.0553934 0.0775255 -0.0364066 0.0107644 -0.0412925 -0.1368697 0.1185692 0.0830723 -0.0211708 0.0437275 -0.0150671 -0.01947 -0.0178354 -0.0184344 -0.1382841 0.0141438 -0.0827519 0.0158304 -0.0300186 -0.0342714 0.0237517 0.0136705 0.0231586 0.1629466 0.1192624 0.0700798 -0.0074882 0.0182446 0.0977246 0.0080942 -0.002139 -0.002811 0.1580125 0.0519726 -0.1143248 0.0177975 -0.0422747 -0.0812893 0.0379653 0.0114653 0.0455258 0.1464578 0.0652784 -0.0113044 0.0053847 -0.0807289 -0.0616628 0.0325218 0.016185 0.0277196 0.1516584 -0.0018033 0.0917589 -0.0091894 0.1009988 -0.0191262 0.0257612 -0.0143782 0.0263004 0.1581296 -0.1095947 -0.0313033 0.01376 -0.0293417 0.0920095 0.0113095 0.0131112 0.0126504 0.1608376 0.2099243 0.1344287 0.0701295 0.1083559 0.3586486 -0.0203325 0.06229 -0.0825843 0.3454042 0.3825766 0.0905621 0.0618017 0.180688 0.236517 -0.1108612 -0.0364406 -0.0113819 0.2148592 unknown
polarizability: 223.3198702|-11.549121|153.2685676|-2.8852041|-8.1417872|76.3534151 unknown
InChI: InChI=1S/C10H8O4S/c11-10-8-4-2-1-3-7(8)5-6-9(10)15(12,13)14/h1-6,11-12H
charge 0 multiplicity 1
23 atoms
S  -3.005487 0.22928 0.035801
O  -0.880024 -1.845539 0.38685
O  -3.226233 -0.746212 1.584722
O  -3.708736 1.651661 0.312426
O  -3.43164 -0.673995 -1.233149
C  1.133086 -0.390383 0.114469
C  1.623517 0.96045 -0.082121
C  -1.1429 0.506413 0.052472
C  -0.291448 -0.590636 0.164207
C  0.700127 2.054237 -0.174392
C  -0.674782 1.837099 -0.101246
C  2.070578 -1.465968 0.253787
C  3.039734 1.168832 -0.159747
C  3.443906 -1.225111 0.171891
C  3.932234 0.102018 -0.042072
H  1.089319 3.069286 -0.303558
H  -1.40028 2.654446 -0.156831
H  1.727142 -2.49026 0.446758
H  3.412458 2.188177 -0.311357
H  4.152351 -2.052562 0.281139
H  5.011223 0.276728 -0.104353
H  -0.304044 -2.595986 0.103443
H  -2.698103 -1.588074 1.425761
