program: Gaussian 09
title: 000141317
version: EM64L-G09RevD.01
frameworkgroup: C1[X(C14H17NO3)]
method: RPBEPBE
basis: SDD
operation: Freq
keyword: #p
keyword: freq=noraman
keyword: PBEPBE/SDD
title: #p freq=noraman PBEPBE/SDD
converged: YES YES NO NO
title: Mulliken charges:
elementType: O O O N C C C C C C C C C C C C C C H H H H H H H H H H H H H H H H H
charge: -0.402486 -0.259360 -0.290185 -0.447691 -0.054004 -0.222941 -0.434015 -0.449843 -0.395991 -0.385230 0.162516 0.163042 0.258222 -0.358451 -0.364422 -0.225858 -0.243591 -0.227995 0.272770 0.257262 0.268407 0.194320 0.216692 0.220847 0.212604 0.207212 0.197463 0.207837 0.337291 0.380997 0.273002 0.241971 0.230132 0.229172 0.230302
chargesum: 0.00000
title: Mulliken charges with hydrogens summed into heavy atoms:
elementType: O O O N C C C C C C C C C C C C C C
charge: -0.021489 -0.259360 -0.290185 -0.110400 0.218766 0.034320 0.028712 -0.012303 0.023825 0.020070 0.162516 0.163042 0.258222 -0.085449 -0.122451 0.004275 -0.014419 0.002307
polarizability: 2.07958613e+02 3.36783064e+00 1.57016564e+02 1.10651001e+01 1.69881245e+01 1.22037720e+02
1716.lowfreq: -12.0517 -8.3623 -0.0007 -0.0003 -0.0001 5.3550 28.8345 35.2116 45.9037
frequency: 28.6665 35.0827 45.7874 64.4359 69.7074 107.2281 142.7059 159.9854 202.3546 209.6246 233.0905 276.7108 311.5919 326.6428 346.0073 399.3079 404.4644 424.3046 470.0421 488.1753 510.9577 553.9967 612.3889 614.1958 618.7682 650.2875 666.2628 692.2154 707.9776 720.3460 773.4133 793.9414 816.3464 843.9512 847.9171 859.8340 895.2604 904.6904 924.7720 939.9614 985.9879 987.2651 992.7160 1003.1605 1004.3891 1027.2447 1040.8911 1062.0010 1063.1376 1084.7497 1104.8972 1116.6798 1136.1927 1153.5802 1172.6291 1192.2400 1195.5000 1224.6172 1245.2280 1258.4560 1268.9801 1299.4488 1309.5255 1320.7954 1325.6330 1336.7833 1338.6468 1351.9154 1363.8652 1371.1316 1384.2270 1432.6025 1462.8726 1465.5592 1467.6585 1471.9411 1477.4482 1502.7540 1569.0170 1604.0818 1611.5352 1633.5903 2969.9906 2976.7883 2984.8123 2988.5243 2994.0533 3033.9134 3038.3237 3046.4704 3056.9776 3071.0055 3117.3702 3129.5558 3142.8410 3156.3606 3167.7265 3498.4325 3516.2840
redmass: 5.2617 5.2343 4.9496 5.9470 4.9096 3.8230 4.6841 4.7776 4.0946 3.0861 3.9575 4.5986 3.8958 2.5222 5.3785 2.8106 2.8197 4.3744 2.1899 3.9025 3.3920 1.2196 2.3136 4.4539 2.4516 2.5728 3.9393 4.3225 1.5571 3.9770 2.2350 2.4019 1.9702 2.6788 4.5952 1.2536 2.4835 2.0134 2.1750 1.4448 1.4710 3.8980 2.6105 3.2127 1.3488 2.2364 1.6577 1.8554 1.9758 1.5885 1.6066 2.5273 1.7226 2.6669 1.0626 1.5666 1.1696 1.3281 1.4070 1.3745 1.4967 1.8821 1.2621 1.4154 1.4214 1.4057 1.3900 1.4929 1.8513 1.3677 8.3564 2.2397 1.0878 1.1767 1.1508 1.4180 1.2299 2.0512 5.9896 6.1582 5.9855 7.6472 1.0634 1.0693 1.0619 1.0611 1.0829 1.0948 1.0951 1.0987 1.0962 1.0965 1.0881 1.0870 1.0920 1.0956 1.1007 1.0638 1.0779
irintensity: 1.5439 1.7285 2.2699 3.1493 4.6343 2.6790 0.3746 2.3815 5.7480 1.9036 2.5520 6.4794 5.7865 1.4457 0.6287 0.2741 0.3940 6.5334 4.5880 0.8543 11.0395 95.9469 64.6782 13.6657 67.1624 3.6459 10.0641 3.7771 112.2883 49.9150 3.6921 19.9241 7.9080 4.3650 12.1123 1.4035 5.9371 5.9308 4.7044 3.6338 2.0538 1.2640 1.2471 49.7385 0.7976 10.9983 20.5009 222.9206 3.5886 14.6869 2.5999 20.7582 3.3544 18.7974 1.2210 3.4706 7.5773 0.4947 1.3757 6.5991 46.9738 64.4678 12.7423 12.2440 17.8172 2.8898 4.8401 9.9240 62.4618 8.3987 1.3892 3.4946 11.5462 64.1888 18.3101 140.3992 15.1792 298.4340 96.0320 49.8803 6.1483 188.8478 35.0788 19.5978 27.4853 20.7775 31.3621 46.9614 18.4594 32.8743 69.9464 16.0195 3.3086 1.5125 18.5950 17.2145 25.2077 30.4260 42.6543
temp: 298.150 k
press: 1.00000 atm
elementType: 8 8 8 7 6 6 6 6 6 6 6 6 6 6 6 6 6 6 1 1 1 1 1 1 1 1 1 1 1 1 1 1 1 1 1
symmnumber: 1
zpe: 753673.7 jmol-1
zpe.correction: 0.287059 hartree
zpe.thermalcorrener: 0.303461 hartree
zpe.thermalcorrenthalpy: 0.304405 hartree
zpe.thermalcorrgfe: 0.241466 hartree
zpe.sumelectzpe: -822.812777 hartree
zpe.sumelectthermal: -822.796375 hartree
zpe.sumelectthermalent: -822.795431 hartree
zpe.sumelectthermalfe: -822.858370 hartree
dipole: -2.0266 1.8887 2.0417
dipole: 3.4413
quadrupole: -91.0490 -102.2797 -111.6356
quadrupole: 1.2362 3.9470 -5.7167
quadrupole: 10.6057 -0.6249 -9.9809 1.2362 3.9470 -5.7167
hfenergy: -823.0998363 hartree
pointgroup: C01 [X(C14H17N1O3)]
dipole: -0.8204319 0.6895904 0.8273164 debye
polarizability: 207.4405229|2.9215894|155.1016856|12.6523681|18.9822225|124.4706888 unknown
InChI: InChI=1S/C14H17NO3/c16-13(10-6-2-1-3-7-10)15-12-9-5-4-8-11(12)14(17)18/h1-3,6-7,11-12,15,17H,4-5,8-9H2
charge 0 multiplicity 1
35 atoms
O  -2.88609 2.563436 -1.224573
O  -1.328101 2.361685 0.478995
O  0.893857 -1.54791 -1.740694
N  -0.27537 -0.292871 -0.174237
C  -1.593571 -0.55877 -0.788053
C  -2.672695 0.39229 -0.164458
C  -2.037026 -2.037988 -0.627156
C  -3.00668 0.013852 1.3094
C  -2.348256 -2.405816 0.838738
C  -3.427032 -1.468353 1.4279
C  -2.216125 1.836826 -0.240373
C  0.897817 -0.748672 -0.746563
C  2.182334 -0.254167 -0.126787
C  3.357847 -1.008273 -0.372823
C  2.267747 0.934629 0.646604
C  4.595625 -0.598543 0.164094
C  3.509844 1.346861 1.178189
C  4.674569 0.57929 0.945011
H  -1.503266 -0.349817 -1.872913
H  -3.5820 0.284476 -0.781348
H  -1.237672 -2.674858 -1.042972
H  -2.940299 -2.193823 -1.252254
H  -3.815728 0.673618 1.676707
H  -2.126951 0.207908 1.953036
H  -1.420953 -2.329934 1.440903
H  -2.682897 -3.458602 0.897037
H  -4.384627 -1.626057 0.889888
H  -3.614298 -1.712038 2.491079
H  -0.234258 0.376686 0.59793
H  -2.533027 3.495325 -1.251238
H  3.272664 -1.904254 -0.996473
H  1.387506 1.569107 0.809858
H  5.497026 -1.191283 -0.026859
H  3.569833 2.270034 1.765115
H  5.636355 0.901405 1.359794
