program: Gaussian 09
title: 000141311
version: EM64L-G09RevD.01
frameworkgroup: C1[X(C8H15NO)]
method: RPBEPBE
basis: SDD
operation: Freq
keyword: #p
keyword: freq=noraman
keyword: PBEPBE/SDD
title: #p freq=noraman PBEPBE/SDD
converged: NO YES NO NO
title: Mulliken charges:
elementType: O N C C C C C C C C H H H H H H H H H H H H H H H
charge: -0.437625 0.011498 0.309301 -0.498553 -0.505713 -0.455607 -0.455741 -0.464336 -0.461358 -0.425098 0.213100 0.208065 0.206825 0.208072 0.232832 0.201677 0.223195 0.233303 0.226400 0.231610 0.223583 0.230336 0.189856 0.217415 0.336961
chargesum: 0.00000
title: Mulliken charges with hydrogens summed into heavy atoms:
elementType: O N C C C C C C C C
charge: -0.100664 0.011498 0.309301 -0.077388 -0.090816 -0.021098 0.000758 -0.006325 -0.007439 -0.017826
polarizability: 9.32658316e+01 8.90986058e-01 8.77170275e+01 2.38612369e-01 9.90517940e-01 8.61408881e+01
1716.lowfreq: -22.1063 -15.8281 -0.0006 -0.0005 0.0000 12.6457 84.5733 98.2151 169.6133
frequency: 84.5346 98.0112 169.6100 239.2758 285.2971 305.4596 349.2349 364.8468 402.0002 412.1576 535.2456 539.2250 566.7692 672.2106 750.2385 783.2720 818.9778 819.8395 872.0198 895.5802 924.1636 945.5139 948.9184 968.5803 985.2291 1002.8519 1019.6533 1047.6925 1055.3663 1130.3786 1132.5926 1144.3752 1173.1576 1191.8520 1230.0342 1246.8803 1254.4425 1271.3335 1285.1508 1308.2219 1312.0887 1315.4952 1318.8752 1322.3030 1333.1320 1341.0863 1373.5562 1456.3613 1457.7375 1461.0270 1464.8017 1468.1321 1470.1231 1486.0509 2933.0330 2958.9100 2967.2101 2978.8265 2996.2548 2996.5548 3002.0022 3015.1729 3022.3779 3039.6344 3055.2014 3057.7789 3065.9879 3068.0422 3565.0670
redmass: 1.7919 2.8184 4.1595 1.7768 1.9686 1.2456 1.7632 2.8858 2.0855 2.9504 3.7882 3.7195 5.6087 3.9216 5.0228 1.2118 1.4017 1.3678 1.8916 3.7558 3.5605 1.4819 2.4453 3.2298 3.7881 2.1966 2.1028 3.0958 2.7263 1.6682 1.7320 1.1762 2.1130 1.4261 1.1140 1.3882 1.3314 1.3745 1.4610 1.3029 1.4049 1.3726 1.3533 1.3785 1.4361 1.4256 1.2304 1.0805 1.0809 1.0796 1.0821 1.0833 1.0845 1.0929 1.0680 1.0579 1.0587 1.0606 1.0599 1.0596 1.0636 1.1033 1.1029 1.1017 1.0953 1.1063 1.1061 1.1054 1.0658
irintensity: 0.3691 3.2357 3.6963 13.3563 28.3499 112.1730 26.6630 1.8042 8.8870 0.1155 2.0306 0.9144 22.7647 8.6547 9.8937 0.1791 4.9953 6.2848 9.4883 6.1906 4.7071 0.3816 24.8909 11.5511 81.8475 1.1664 6.0211 12.7934 6.6137 30.3661 3.1488 0.2427 7.3995 11.7784 0.8525 11.0167 8.5106 3.6766 11.5467 3.2008 9.1123 4.2627 5.2607 1.5676 0.3844 1.0272 17.3148 1.1123 1.3961 3.1250 12.0118 16.7146 11.5029 1.4683 60.9385 44.0171 54.6401 36.1076 83.2529 78.0635 36.2651 13.7488 16.0913 7.0674 20.4610 2.0587 79.5492 85.0024 3.9034
temp: 298.150 k
press: 1.00000 atm
elementType: 8 7 6 6 6 6 6 6 6 6 1 1 1 1 1 1 1 1 1 1 1 1 1 1 1
symmnumber: 1
zpe: 583377.0 jmol-1
zpe.correction: 0.222197 hartree
zpe.thermalcorrener: 0.231585 hartree
zpe.thermalcorrenthalpy: 0.232529 hartree
zpe.thermalcorrgfe: 0.188194 hartree
zpe.sumelectzpe: -442.980280 hartree
zpe.sumelectthermal: -442.970891 hartree
zpe.sumelectthermalent: -442.969947 hartree
zpe.sumelectthermalfe: -443.014282 hartree
dipole: 0.2231 0.5378 -1.3803
dipole: 1.4980
quadrupole: -76.0303 -58.4190 -58.9025
quadrupole: 1.3270 4.3397 1.8213
quadrupole: -11.5797 6.0316 5.5481 1.3270 4.3397 1.8213
hfenergy: -443.2024761 hartree
pointgroup: C01 [X(C8H15N1O1)]
dipole: 0.0948545 -0.2789871 0.510417 debye
dipolederiv: -0.8705229 0.1241893 0.1390875 0.1664955 -0.5836443 0.0717323 0.154704 0.0527794 -0.1825067 -0.6829442 -0.0579309 -0.0017216 -0.0506475 -0.412021 0.0255762 0.0156214 -0.026364 -0.4009744 -0.0726521 0.0169057 0.0085606 -0.0295064 0.0158899 -0.003188 0.0017799 0.0232591 0.0616017 -0.1686538 0.0117223 0.0081008 0.023471 -0.0249288 0.0050394 0.0136511 0.0004371 0.1230669 -0.1857457 -0.048041 0.0020028 -0.0828534 0.0513482 -0.0834757 -0.0393385 -0.104042 -0.0018602 -0.1280476 -0.0498699 0.0054575 -0.0630534 0.0318213 0.0828435 0.0265264 0.0973456 -0.0158339 0.3577332 -0.0244754 0.0024689 0.0148705 0.3585217 -0.0045605 -0.0091107 0.0106143 0.1629593 0.3933889 0.0490843 0.0009269 0.0243374 0.2163118 0.0832477 -0.0462446 0.0901494 0.3203197 0.3464433 0.038821 -0.0082429 0.0256997 0.2253507 -0.1039896 0.0367411 -0.0767705 0.308415 0.5866418 -0.1324984 -0.0511139 -0.1172418 0.4789267 -0.0111945 -0.0828587 -0.0034644 0.2632081 0.0310519 -0.0837053 -0.0464587 -0.0418483 -0.0512575 -0.0915913 -0.0567678 -0.1572641 -0.0607061 0.0304869 -0.0473702 0.0407948 -0.0235256 -0.0038296 0.0843615 0.0526548 0.1502506 -0.1153453 0.0087884 -0.0200416 0.0920693 -0.0605762 0.0212192 0.1244849 0.0855365 0.0605388 -0.1351553 -0.0260513 0.1121738 0.0296837 0.1303247 -0.1246463 -0.0246805 -0.0093757 0.0185369 0.0656713 -0.0040852 0.1002772 -0.0640702 0.1020222 -0.0752426 0.0488085 -0.0117502 0.0041827 0.0767536 0.0296249 -0.0244082 -0.0325772 -0.0551937 -0.0144325 -0.1490745 -0.0415198 -0.0925084 -0.0996448 -0.0481187 0.04895 -0.0710393 0.0393588 -0.0007157 0.0677072 -0.1324052 0.1280449 -0.0552291 -0.0048078 0.0106753 0.0584865 0.0127586 0.0261785 -0.0589915 0.1254185 -0.1144995 -0.1016054 0.0061158 -0.0361024 0.0010201 -0.0753417 -0.1788004 -0.0802276 0.0141521 -0.0057095 0.0731395 -0.0226346 0.0216633 -0.065056 0.0655223 0.041811 0.1272394 -0.0770925 0.0556552 -0.1029582 -0.0398525 0.0013973 0.0976005 0.0451573 0.070035 -0.0879112 0.0957704 -0.0162911 -0.1307837 0.0216892 -0.0051372 -0.0155704 -0.0544264 -0.1854615 0.0298108 -0.0282618 -0.0419688 0.0775057 -0.0155395 0.0215756 0.02594 -0.0054696 -0.1004129 0.1086377 0.0790488 0.1724477 -0.1030052 0.0338973 -0.0010254 -0.0291127 -0.0056695 -0.0054744 -0.0773501 -0.0690068 -0.1282347 -0.0732679 0.4237944 -0.0268292 -0.127237 0.0153355 0.2234533 -0.0832543 -0.0978726 -0.0971248 0.0462352 unknown
polarizability: 93.2402679|-0.871927|87.4555027|-0.4605394|1.1739548|86.4279766 unknown
InChI: InChI=1S/C8H15NO/c10-7-8-1-4-9(5-2-8)6-3-8/h10H,1-7H2
charge 0 multiplicity 1
25 atoms
O  -3.058968 0.511671 0.010844
N  1.906392 0.299299 -0.000326
C  -0.657144 -0.278467 0.002903
C  0.200062 -1.577352 0.070861
C  -0.288433 0.605711 1.232705
C  -0.268203 0.4937 -1.290283
C  1.719201 -1.182353 -0.045291
C  1.270512 0.833309 1.239014
C  1.243433 0.913745 -1.191798
C  -2.156454 -0.650119 0.005844
H  -0.09344 -2.263483 -0.747926
H  0.001208 -2.103923 1.025802
H  -0.618246 0.108763 2.16762
H  -0.8148 1.57872 1.164871
H  -0.930731 1.370966 -1.406828
H  -0.439215 -0.162352 -2.166649
H  2.308968 -1.6294 0.775517
H  2.149679 -1.542951 -0.997259
H  1.511719 1.909003 1.314273
H  1.738691 0.326293 2.102314
H  1.801425 0.60329 -2.093753
H  1.34636 2.010567 -1.10022
H  -2.373176 -1.316948 0.870937
H  -2.41571 -1.189638 -0.922576
H  -2.952431 0.991351 0.870501
