program: Gaussian 09
title: 000011271
version: EM64L-G09RevD.01
frameworkgroup: C1[X(C7H14O)]
method: RPBEPBE
basis: SDD
operation: Freq
keyword: #pfreq=noraman
keyword: PBEPBE/SDD
title: #p freq=noraman PBEPBE/SDD
converged: YES YES NO NO
title: Mulliken charges:
elementType: O C C C C C C C H H H H H H H H H H H H H H
charge: -0.209507 -0.180150 -0.180148 0.230511 -0.692585 -0.690852 -0.692592 -0.690849 0.213807 0.213797 0.239795 0.207201 0.218068 0.216523 0.232648 0.225045 0.218064 0.207207 0.239797 0.232655 0.225043 0.216522
chargesum: 0.00000
title: Mulliken charges with hydrogens summed into heavy atoms:
elementType: O C C C C C C C
charge: -0.209507 0.033657 0.033649 0.230511 -0.027521 -0.016636 -0.027525 -0.016629
polarizability: 8.67171435e+01 1.25997980e-01 7.17033491e+01 -1.22849663e-04 -2.51601974e-03 7.39570207e+01
1716.lowfreq: 0.0005 0.0008 0.0009 6.8006 10.5857 13.2854 33.2395 63.0493 173.8308
frequency: 33.1765 63.0177 173.8202 180.0391 191.8376 196.8876 230.5770 232.5969 274.2750 310.5593 318.4717 368.8846 456.8147 603.2964 728.0405 731.2429 852.8019 891.3996 920.7812 922.6761 959.3289 959.4881 1022.8487 1066.0939 1084.0692 1113.6125 1126.6394 1176.5662 1178.9172 1270.5962 1284.1091 1326.1694 1349.4358 1374.2890 1375.7357 1390.9406 1394.3813 1462.8959 1463.0006 1467.7313 1468.7166 1477.4773 1478.0320 1486.8352 1489.2623 1625.8469 2978.8060 2978.8086 2979.5600 2983.1953 2987.6894 2988.7563 3075.4086 3075.6541 3081.8007 3082.0685 3084.2898 3084.7819 3095.9615 3096.4365
redmass: 3.8249 2.4716 1.7965 1.9480 1.0847 1.3580 1.0800 1.3501 2.1646 3.8098 2.8622 2.2607 2.6721 3.0567 3.8986 2.5648 2.9743 2.4600 1.1581 1.1611 1.3505 1.4010 2.8927 1.8062 1.5356 2.0566 2.3920 1.9647 1.8369 1.3503 1.3440 1.4538 1.7540 1.1947 1.2125 1.2030 1.2092 1.0439 1.0456 1.0475 1.0495 1.0476 1.0509 1.0536 1.0636 8.1262 1.0475 1.0415 1.0576 1.0690 1.0410 1.0471 1.1001 1.1001 1.1000 1.0999 1.1012 1.1009 1.0995 1.0993
irintensity: 1.9772 0.0635 1.2659 0.8551 0.2621 0.3975 1.0759 0.0162 0.1366 10.7552 0.2754 0.8290 0.0069 1.0495 0.4533 3.8869 1.1926 0.5383 1.4789 6.9252 0.0072 3.3399 105.0763 14.2391 16.5883 4.7478 5.6137 0.6207 4.5363 2.3505 7.1639 2.0881 13.2751 5.4461 28.8066 9.5272 32.7382 0.5436 14.7460 3.7172 0.0086 4.7843 22.0937 19.8312 26.4620 84.8005 43.0746 20.7963 21.8850 27.0372 44.5460 4.0573 6.0054 51.6594 79.0393 2.0648 1.3544 34.1969 23.5836 45.3054
temp: 298.150 k
press: 1.00000 atm
elementType: 8 6 6 6 6 6 6 6 1 1 1 1 1 1 1 1 1 1 1 1 1 1
symmnumber: 1
zpe: 509175.1 jmol-1
zpe.correction: 0.193935 hartree
zpe.thermalcorrener: 0.204624 hartree
zpe.thermalcorrenthalpy: 0.205568 hartree
zpe.thermalcorrgfe: 0.157953 hartree
zpe.sumelectzpe: -349.700149 hartree
zpe.sumelectthermal: -349.689460 hartree
zpe.sumelectthermalent: -349.688516 hartree
zpe.sumelectthermalfe: -349.736131 hartree
dipole: 0.0001 0.0014 -2.9882
dipole: 2.9882
quadrupole: -48.3728 -50.0743 -55.9172
quadrupole: 0.6239 0.0004 0.0031
quadrupole: 3.0820 1.3805 -4.4624 0.6239 0.0004 0.0031
hfenergy: -349.894084 hartree
pointgroup: C01 [X(C7H14O1)]
dipole: -0.0000148 0.0011333 1.1756607 debye
dipolederiv: -0.6281878 -0.0177506 0.0000106 -0.0685858 -0.2867421 -0.0004927 0.0000767 -0.000552 -0.8280039 -0.2670074 0.0343975 -0.1590925 0.0878482 0.075728 0.1107416 -0.1750515 0.0582674 -0.0050305 -0.2670546 0.0347085 0.1589745 0.0883106 0.07534 -0.1109309 0.1747635 -0.0584209 -0.0045754 1.1244917 -0.0657356 0.0001241 0.0928264 -0.0203202 0.000886 -0.0000669 0.0008736 0.8541751 -0.0021718 -0.0365086 0.0565067 -0.0354075 0.0097491 0.0320585 -0.0011194 0.0233934 0.0186097 0.0223822 0.0057402 -0.0238588 -0.0906373 0.0077783 -0.032314 -0.024601 0.0369413 0.0585762 -0.0021357 -0.0366267 -0.0564273 -0.0353924 0.0096379 -0.0320378 0.0012186 -0.0233643 0.0187232 0.022367 0.0058053 0.0238434 -0.0905937 0.0077653 0.0324344 0.0248228 -0.0368148 0.0585643 0.025557 0.0326548 0.0775091 0.0071008 -0.0065349 -0.078198 0.0992296 -0.0697694 -0.1040591 0.0255822 0.0324769 -0.077582 0.0068858 -0.0062289 0.0779828 -0.0992229 0.0695658 -0.1044215 0.1046989 -0.000449 0.0177798 0.0306422 0.050931 -0.0958564 0.0821963 -0.0522043 -0.0583372 -0.1414707 -0.0344971 -0.0936706 -0.0076279 0.0899367 0.0171659 -0.1269467 -0.0022381 0.0188388 0.0632026 0.0879087 -0.0002746 0.0372527 -0.1509376 0.0447436 0.0091174 0.0426585 0.0817782 -0.0182121 -0.1175194 0.1070366 -0.0950572 -0.017969 0.0598827 0.0901033 0.0791679 0.0315488 0.0718566 0.0427084 0.0220224 0.0408507 0.0302319 -0.0443688 0.0668222 -0.1104342 -0.0719914 -0.1069805 0.0271854 -0.1361119 0.0127564 0.0646507 -0.0009884 -0.1214775 0.0029273 0.0169365 0.063194 0.0879267 0.0000862 0.0372447 -0.1511279 -0.0442439 -0.0091952 -0.0421516 0.0819684 -0.1414791 -0.034314 0.0937417 -0.0073675 0.0899015 -0.0173164 0.1269522 0.0020882 0.0188792 0.1046958 -0.0004897 -0.017782 0.030471 0.0512595 0.0956215 -0.0822608 0.0519566 -0.058661 0.0718629 0.0426525 -0.0221024 0.0406956 0.0305844 0.0441345 -0.0669048 0.1101995 -0.0723309 -0.1069934 0.0274785 0.1360439 0.0130337 0.0646475 0.0008782 0.121435 -0.0030232 0.0169654 -0.0181977 -0.1177526 -0.1067769 -0.0952496 -0.0182814 -0.0597823 -0.089891 -0.0790667 0.031847 unknown
polarizability: 86.7170286|0.1326679|71.7034615|0.0004756|0.000756|73.9570233 unknown
InChI: InChI=1S/C7H14O/c1-5(2)7(8)6(3)4/h5-6H,1-4H3
charge 0 multiplicity 1
22 atoms
O  -0.000024 -0.00147 -1.601906
C  1.303418 0.148871 0.464332
C  -1.303471 -0.147857 0.464593
C  -0.000008 -0.000376 -0.340964
C  2.359112 0.981922 -0.290325
C  1.833117 -1.284523 0.77531
C  -2.35909 -0.982612 -0.288287
C  -1.833219 1.286209 0.772338
H  1.056803 0.633825 1.430984
H  -1.056909 -0.63066 1.432332
H  2.550782 0.541591 -1.28402
H  3.30825 1.011361 0.275216
H  2.015518 2.020104 -0.447897
H  1.084045 -1.898662 1.308475
H  2.101922 -1.802872 -0.162679
H  2.736698 -1.222793 1.408094
H  -2.015427 -2.021114 -0.443603
H  -3.308239 -1.010891 0.277295
H  -2.550768 -0.544445 -1.282938
H  -2.101975 1.802457 -0.166826
H  -2.736841 1.225879 1.405199
H  -1.084192 1.901556 1.304176
