program: Gaussian 09
title: 000141286
version: EM64L-G09RevD.01
frameworkgroup: C1[X(C16H36Si7)]
method: RPBEPBE
basis: SDD
operation: Freq
keyword: #p
keyword: freq=noraman
keyword: PBEPBE/SDD
title: #p freq=noraman PBEPBE/SDD
converged: YES YES NO NO
title: Mulliken charges:
elementType: Si Si Si Si Si Si Si C C C C C C C C C C C C C C C C H H H H H H H H H H H H H H H H H H H H H H H H H H H H H H H H H H H H
charge: 1.285641 1.311275 1.311268 1.311273 1.311276 1.279997 1.279996 -1.342195 -1.342197 -1.104251 -1.104251 -1.127998 -1.127997 -1.120697 -1.120695 -1.120696 -1.120696 -0.996697 -0.996694 -0.996696 -0.996696 -1.002613 -1.002613 0.264982 0.264982 0.239261 0.239262 0.239262 0.239261 0.245610 0.247567 0.247567 0.245609 0.236874 0.241256 0.241256 0.236874 0.236874 0.241255 0.241255 0.236874 0.228036 0.232284 0.229663 0.228036 0.229664 0.232283 0.228037 0.232284 0.229663 0.232283 0.228036 0.229664 0.231068 0.231437 0.231068 0.231068 0.231068 0.231437
chargesum: 0.00000
title: Mulliken charges with hydrogens summed into heavy atoms:
elementType: Si Si Si Si Si Si Si C C C C C C C C C C C C C C C C
charge: 1.285641 1.311275 1.311268 1.311273 1.311276 1.279997 1.279996 -1.077213 -1.077215 -0.625729 -0.625729 -0.634821 -0.634821 -0.642568 -0.642566 -0.642567 -0.642567 -0.306714 -0.306711 -0.306713 -0.306713 -0.309040 -0.309040
polarizability: 3.65816677e+02 3.51748198e-05 3.13870249e+02 -6.87574180e-04 1.30854406e-04 3.05364743e+02
1716.lowfreq: -6.1645 -0.0025 -0.0023 -0.0017 9.8412 13.5016 41.7056 102.1170 110.7875
frequency: 41.6156 102.1166 110.7875 115.0151 119.6885 123.7833 131.1952 131.1969 133.3562 135.0732 135.8007 137.3344 138.9918 139.0285 140.6053 147.4474 151.1147 169.1618 185.9989 190.9870 192.8488 199.4689 206.6403 210.3193 219.2241 222.8741 225.0175 227.7353 237.5675 241.0835 244.7871 266.6752 279.6326 292.3424 295.0297 304.2098 322.9803 327.4234 344.7074 381.2948 403.2650 533.4207 570.1045 579.6029 585.0300 597.7484 600.4032 603.5186 614.9143 617.7036 624.3521 627.6649 642.8769 644.9370 650.9514 663.8388 668.2541 673.8755 682.0688 705.3688 711.9457 719.0656 722.8450 730.0724 730.2353 736.4810 738.8421 739.1232 740.6490 744.5276 745.1698 750.5098 757.0545 757.1663 760.7367 760.9966 775.4488 799.2632 804.1575 814.5241 820.9550 839.8148 850.0511 852.4254 861.8359 878.4350 878.9717 880.1007 890.2243 947.4686 956.2067 993.7837 1006.6078 1021.3787 1023.4213 1032.8394 1039.9662 1043.8853 1046.4254 1051.0272 1056.8982 1063.0164 1069.0472 1072.2398 1073.1544 1081.3433 1082.7675 1086.5785 1091.8566 1280.3026 1280.3550 1284.4368 1284.5375 1291.0196 1291.2335 1378.5623 1384.9523 1384.9627 1387.3495 1387.4084 1400.0448 1402.9253 1421.7888 1437.5666 1437.7404 1442.9607 1443.1992 1447.6063 1447.6640 1447.6883 1447.7752 1453.5129 1453.7056 1459.5095 1460.4228 2952.2903 2952.9216 2970.5294 2970.6456 2971.1968 2971.3911 2973.2997 2974.3771 2974.9405 2975.2916 2978.4830 2978.6170 2979.9406 2979.9515 2980.0526 2981.0668 3036.4615 3036.5083 3036.9330 3037.0130 3039.3730 3041.4634 3049.6478 3056.8699 3079.2031 3079.4303 3080.8800 3080.9145 3081.3919 3081.4521 3082.0363 3082.0696 3090.2757 3090.3022 3096.5893 3096.7521
redmass: 3.6790 2.6098 2.7742 1.3367 1.6267 1.3354 1.2858 2.1188 1.6799 1.0889 2.2912 1.3899 2.0288 1.9798 2.5895 3.3156 2.1980 2.5372 2.3714 3.3569 3.9350 3.1186 2.0277 2.8990 2.7366 3.0638 2.1840 2.7543 2.9290 2.1614 2.3859 2.9323 4.1669 4.1288 2.8842 5.5015 4.9578 5.3476 6.0787 3.0427 6.1713 3.8578 3.1198 4.4711 4.0700 3.8299 3.8590 4.3875 2.9768 1.4639 1.6380 3.8897 3.7787 1.7567 3.3237 4.0569 4.5027 4.0000 2.9708 2.5829 2.9688 6.1048 3.6684 3.0819 2.5985 3.5347 3.5506 3.2597 4.2463 2.3417 3.3531 2.9086 2.4133 2.5865 1.8891 1.6962 1.8669 1.3163 1.3257 1.4695 1.4262 1.4372 1.4112 1.5462 1.5185 1.9008 1.7650 1.9249 1.8688 1.0337 1.1087 1.0750 1.1542 1.0834 1.1162 1.1439 1.1370 1.3150 1.1931 1.1890 1.2988 1.2736 1.2103 1.1151 1.3284 1.3579 1.3271 1.3504 1.3588 1.2039 1.2031 1.1995 1.1996 1.1967 1.1966 1.0884 1.0859 1.0861 1.0851 1.0853 1.0807 1.0781 1.0800 1.0513 1.0515 1.0538 1.0534 1.0523 1.0522 1.0524 1.0524 1.0521 1.0521 1.0528 1.0522 1.0795 1.0803 1.0580 1.0580 1.0576 1.0573 1.0567 1.0487 1.0351 1.0426 1.0338 1.0352 1.0584 1.0443 1.0340 1.0500 1.0995 1.0994 1.0989 1.0988 1.0996 1.0989 1.0978 1.0945 1.0990 1.0988 1.0985 1.0984 1.0981 1.0980 1.0986 1.0986 1.0989 1.0988 1.0974 1.0972
irintensity: 0.0000 0.0380 0.0639 0.2501 0.0000 0.0000 0.0759 0.0354 0.1655 0.0000 0.3656 0.0143 0.0003 0.4249 0.3544 0.0000 0.7841 0.5720 0.5476 0.0000 0.0511 0.1598 0.4698 1.0976 1.3387 0.0000 2.2378 0.0000 1.4544 9.8250 0.8850 0.0660 0.2531 0.0000 0.2855 1.4968 0.1899 0.0173 0.4429 0.1187 0.0058 12.3842 0.0974 21.8471 5.0917 0.0000 16.5914 17.0804 5.8741 0.0000 2.1796 2.1795 3.9619 0.0057 0.0000 5.6085 0.8772 0.2393 5.6446 0.0000 14.2149 76.5111 2.3969 55.9059 0.0011 98.7897 0.0001 15.9100 9.2171 116.4676 28.8298 3.6891 9.0140 0.0003 83.3171 28.7584 1.6038 0.0000 0.1394 0.0000 26.8600 35.0688 26.2464 40.9525 0.0000 684.5271 224.6121 450.9316 193.0923 0.0000 8.1754 0.0000 13.1884 0.2028 20.7321 16.2844 0.0000 66.4255 0.0000 4.6350 0.0796 0.0000 132.2132 0.6995 93.9890 88.1593 0.0000 185.2502 56.0444 0.0037 5.4221 41.9839 23.3736 81.0630 37.8287 1.0960 2.1613 5.5188 18.4004 0.0007 14.5975 14.9608 14.8144 0.0002 32.2857 0.0000 2.0681 12.3059 0.0019 5.2037 10.5389 7.2034 6.7281 0.6531 23.6764 3.6009 9.4614 0.0001 30.5951 30.5157 0.4821 0.0027 4.3531 46.7067 52.6847 0.0000 2.6883 14.1102 0.4661 63.7097 40.5483 0.0001 5.1670 9.6371 18.4916 0.0000 18.7634 19.9464 4.5435 0.0045 56.8076 17.6943 17.7656 8.0023 17.1637 0.0097 37.8033 0.2813 25.7390 7.4973 34.7719
temp: 298.150 k
press: 1.00000 atm
elementType: 14 14 14 14 14 14 14 6 6 6 6 6 6 6 6 6 6 6 6 6 6 6 6 1 1 1 1 1 1 1 1 1 1 1 1 1 1 1 1 1 1 1 1 1 1 1 1 1 1 1 1 1 1 1 1 1 1 1 1
symmnumber: 1
zpe: 1250117.9 jmol-1
zpe.correction: 0.476145 hartree
zpe.thermalcorrener: 0.508315 hartree
zpe.thermalcorrenthalpy: 0.509259 hartree
zpe.thermalcorrgfe: 0.419007 hartree
zpe.sumelectzpe: -2655.438927 hartree
zpe.sumelectthermal: -2655.406757 hartree
zpe.sumelectthermalent: -2655.405813 hartree
zpe.sumelectthermalfe: -2655.496065 hartree
dipole: 0.0000 0.0000 0.2079
dipole: 0.2079
quadrupole: -194.4906 -194.0252 -194.9156
quadrupole: 0.0000 0.0000 0.0000
quadrupole: -0.0135 0.4520 -0.4385 0.0000 0.0000 0.0000
hfenergy: -2655.9150722 hartree
pointgroup: C01 [X(C16H36Si7)]
dipole: -0.000005 -0.0000024 0.0817932 debye
polarizability: 365.8166766|0.0007569|313.8702489|0.0006876|-0.0001308|305.3647433 unknown
InChI: InChI=1S/C16H36Si7/c1-17-7-19(3)13-20(4,8-17)16-22(6)10-18(2)9-21(5,14-22)15(19)23(16,11-17)12-18/h15-16H,7-14H2,1-6H3
charge 0 multiplicity 1
59 atoms
Si -0.000008 0.000022 1.290527
Si -1.650048 -1.60006 -0.903814
Si 1.650116 -1.600006 -0.90379
Si -1.650082 1.599942 -0.90391
Si 1.650079 1.599997 -0.90386
Si -3.194023 -0.000004 1.424509
Si 3.194006 0.000063 1.424577
C  0.000025 -1.542157 0.109923
C  -0.000014 1.542142 0.109842
C  -1.558922 0.000044 2.419717
C  1.558883 0.000071 2.419749
C  -1.802352 -0.000093 -1.963769
C  1.802414 -0.000026 -1.963728
C  -3.145649 -1.568473 0.315662
C  3.145692 -1.568399 0.315717
C  -3.145682 1.568401 0.315566
C  3.145655 1.568476 0.315647
C  -1.797855 -3.165386 -2.005953
C  1.797967 -3.165313 -2.005949
C  -1.79791 3.165187 -2.00616
C  1.797901 3.165261 -2.006084
C  -4.73589 0.000022 2.564683
C  4.735841 0.000111 2.564794
H  0.000039 -2.450297 0.758075
H  -0.000043 2.450313 0.757951
H  -1.510022 0.890448 3.080122
H  -1.510008 -0.890311 3.080186
H  1.509972 -0.890289 3.080211
H  1.509954 0.890469 3.080159
H  -1.053228 -0.000107 -2.778488
H  -2.800199 -0.000115 -2.451056
H  2.800278 -0.000028 -2.450981
H  1.053317 -0.000052 -2.778472
H  -4.078422 -1.639043 -0.282454
H  -3.11712 -2.468981 0.96369
H  3.11717 -2.468912 0.963738
H  4.078479 -1.638943 -0.28238
H  -4.078458 1.638919 -0.282549
H  -3.117167 2.468947 0.963543
H  3.117111 2.469015 0.963632
H  4.07844 1.639018 -0.282452
H  -1.563094 -4.080891 -1.431892
H  -2.833596 -3.254485 -2.384234
H  -1.118712 -3.121532 -2.875497
H  1.56327 -4.080835 -1.431891
H  1.118792 -3.121481 -2.875469
H  2.8337 -3.254357 -2.384267
H  -1.563174 4.080739 -1.432166
H  -2.833647 3.254236 -2.384462
H  -1.118754 3.121282 -2.875693
H  2.833646 3.254338 -2.384359
H  1.563133 4.080799 -1.432079
H  1.118767 3.121357 -2.875633
H  -4.745833 0.895338 3.213901
H  -5.666613 -0.000004 1.967038
H  -4.745821 -0.895248 3.213963
H  4.745739 0.895415 3.214029
H  4.745778 -0.895171 3.214058
H  5.666582 0.000122 1.967177
