program: Gaussian 09
title: 000141272
version: EM64L-G09RevD.01
frameworkgroup: C1[X(C6H14N2)]
method: RPBEPBE
basis: SDD
operation: Freq
keyword: #pfreq=noraman
keyword: PBEPBE/SDD
title: #p freq=noraman PBEPBE/SDD
converged: NO NO NO NO
title: Mulliken charges:
elementType: N N C C C C C C H H H H H H H H H H H H H H
charge: -0.072827 -0.072824 -0.394914 -0.394916 -0.360446 -0.360448 -0.635084 -0.635085 0.202908 0.206475 0.202908 0.206475 0.208772 0.187123 0.208772 0.187124 0.233629 0.205194 0.219170 0.205197 0.219168 0.233628
chargesum: 0.00000
title: Mulliken charges with hydrogens summed into heavy atoms:
elementType: N N C C C C C C
charge: -0.072827 -0.072824 0.014469 0.014467 0.035449 0.035448 0.022909 0.022909
polarizability: 8.70550818e+01 1.01732313e-06 8.45796379e+01 5.20399810e-05 1.19962128e+00 6.36637227e+01
1716.lowfreq: -28.5004 -0.0002 -0.0002 0.0006 15.6915 17.0280 108.6646 190.8438 240.1359
frequency: 108.6632 190.8293 240.1052 264.5901 318.9478 323.0440 386.5928 407.0200 430.7790 453.2550 489.5995 555.1905 653.8576 812.1748 826.5765 872.7104 914.6430 959.1216 971.3457 1041.4829 1069.8424 1086.7826 1086.8056 1104.2153 1115.1895 1142.3372 1152.4636 1182.5362 1232.8847 1241.3558 1270.9060 1287.1548 1337.5679 1348.8915 1361.0749 1369.3365 1413.2279 1423.2081 1446.7161 1447.9510 1452.9929 1458.2567 1460.6967 1465.3332 1486.3392 1495.9072 2866.7893 2868.4019 2886.3998 2890.6291 2978.0329 2984.5538 3030.7127 3033.0723 3037.8871 3043.4787 3045.6669 3053.9832 3088.4875 3096.6815
redmass: 2.5556 2.1867 1.0599 1.3816 1.7192 2.1772 3.2089 1.6671 2.7861 2.7577 3.0028 1.6779 4.2352 2.5978 1.5426 2.5914 1.5488 2.0850 2.1134 1.9233 4.3291 1.5029 1.6588 1.3406 1.7266 2.0435 2.1795 1.4038 1.6301 2.3560 1.2124 1.2164 1.3700 1.4716 1.4335 1.3309 1.1727 1.1551 1.0894 1.0972 1.0834 1.0520 1.0950 1.0619 1.0498 1.0469 1.0691 1.0679 1.0518 1.0552 1.0584 1.0625 1.0893 1.0900 1.1006 1.0779 1.0772 1.1038 1.1012 1.0994
irintensity: 2.1000 1.3931 2.2301 0.2899 1.6272 12.7734 1.3743 0.5492 1.9426 0.0633 0.1460 0.9777 0.0886 10.4332 0.2152 0.2084 8.7910 3.8148 20.4190 13.6974 24.3040 0.2349 6.2636 8.6298 3.7081 0.2411 16.0419 0.4610 0.0570 1.1564 3.1807 3.5171 1.5414 2.8465 1.8625 4.0424 5.4313 0.1670 13.4662 13.1263 2.9812 26.1488 1.3951 10.2798 21.0770 8.0307 116.9800 27.0989 179.6864 54.9104 28.3504 45.2144 66.4229 0.7042 35.6876 61.9246 14.5850 85.7025 36.7166 31.6626
temp: 298.150 k
press: 1.00000 atm
elementType: 7 7 6 6 6 6 6 6 1 1 1 1 1 1 1 1 1 1 1 1 1 1
symmnumber: 1
zpe: 520766.0 jmol-1
zpe.correction: 0.198349 hartree
zpe.thermalcorrener: 0.206658 hartree
zpe.thermalcorrenthalpy: 0.207603 hartree
zpe.thermalcorrgfe: 0.166337 hartree
zpe.sumelectzpe: -345.805475 hartree
zpe.sumelectthermal: -345.797166 hartree
zpe.sumelectthermalent: -345.796222 hartree
zpe.sumelectthermalfe: -345.837487 hartree
dipole: 0.0151 0.0000 0.0000
dipole: 0.0151
quadrupole: -47.5702 -47.1038 -54.4443
quadrupole: 0.0000 0.0000 0.9308
quadrupole: 2.1359 2.6023 -4.7382 0.0000 0.0000 0.9308
hfenergy: -346.0038242 hartree
pointgroup: C01 [X(C6H14N2)]
dipole: 0.0059376 0.0000003 -0.0000008 debye
dipolederiv: -0.5256626 -0.0275262 -0.0186297 -0.0030423 -0.2295099 -0.1214593 0.0218907 -0.0107543 -0.3558718 -0.5256634 0.0275213 0.0186254 0.0030378 -0.2295034 -0.1214612 -0.0218956 -0.0107592 -0.3558704 0.0102209 -0.0503455 -0.0225232 -0.0434348 0.0483007 0.0187153 0.0071015 -0.0096874 0.1393408 0.0102168 0.0503425 0.0225191 0.0434347 0.0483056 0.0187155 -0.0071067 -0.009687 0.1393454 0.3438838 -0.164913 -0.0849848 -0.1075657 0.1645057 0.0356294 -0.0670615 0.0934023 0.3639046 0.3438713 0.164918 0.0849864 0.1075739 0.1645132 0.0356375 0.0670583 0.0934113 0.3639118 0.2711226 0.1261537 0.0694832 0.0864162 0.104731 0.0344292 0.0551355 0.0923321 0.3134078 0.2711292 -0.1261561 -0.0694858 -0.0864155 0.1047332 0.034427 -0.0551331 0.0923287 0.3134035 0.0794572 -0.0203936 0.0060504 -0.0350874 0.0380006 -0.0144869 -0.0617518 0.0293987 -0.1778368 -0.1296337 0.1151292 0.052628 0.118924 -0.0288195 -0.0357223 0.090395 -0.0555548 0.0560667 0.079454 0.0203932 -0.0060418 0.0350874 0.0379999 -0.0144837 0.0617607 0.0294017 -0.1778351 -0.129619 -0.1151285 -0.0526339 -0.1189256 -0.0288257 -0.0357277 -0.0904016 -0.0555609 0.0560594 0.0319424 -0.0397363 0.0253932 -0.001567 -0.1802958 0.058132 0.02191 0.0877794 0.0469441 -0.0354522 0.016299 -0.0269002 0.0170771 0.0649047 0.0009604 0.0727015 -0.1313041 -0.2537254 0.0319445 0.0397365 -0.0253948 0.0015673 -0.1802943 0.0581347 -0.0219116 0.0877847 0.0469389 -0.0354523 -0.0162975 0.0269061 -0.0170807 0.0649011 0.0009535 -0.0726924 -0.1313114 -0.2537257 -0.1365531 0.0362181 0.0616697 0.1158426 0.0903172 -0.0519157 0.0617853 -0.0574534 0.0331366 -0.0067279 -0.0409972 -0.0087927 -0.0306138 0.0774386 0.0111014 -0.1573527 -0.1061078 -0.2332477 0.0973995 0.056738 -0.0296045 -0.0266561 -0.1495751 0.0646202 -0.0232682 0.0679509 0.0678798 -0.0067331 0.040998 0.008795 0.0306162 0.0774385 0.0110952 0.1573562 -0.1061069 -0.2332398 0.0973996 -0.0567291 0.0296044 0.0266643 -0.1495797 0.0646264 0.0232668 0.067954 0.0678773 -0.1365446 -0.0362247 -0.0616696 -0.1158525 0.0903135 -0.0519211 -0.0617863 -0.0574566 0.0331362 unknown
polarizability: 87.0550818|0.0000019|84.5215519|0.0003657|1.6280785|63.7218087 unknown
InChI: InChI=1S/C6H14N2/c1-7-5-3-4-6-8(7)2/h3-6H2,1-2H3
charge 0 multiplicity 1
22 atoms
N  0.614509 0.688388 -0.327854
N  0.614516 -0.688418 0.327904
C  -1.888902 0.72833 -0.252342
C  -1.8889 -0.728399 0.252317
C  -0.586587 1.419077 0.185221
C  -0.586552 -1.419127 -0.185198
C  1.833664 1.427945 0.08975
C  1.833696 -1.42794 -0.089671
H  -1.952797 0.743463 -1.358235
H  -2.756544 1.288651 0.146354
H  -1.952833 -0.743541 1.358208
H  -2.756509 -1.288744 -0.146418
H  -0.535831 2.442273 -0.231831
H  -0.557666 1.489182 1.30226
H  -0.53579 -2.442313 0.231879
H  -0.5576 -1.489256 -1.302233
H  2.733504 0.998968 -0.380108
H  1.972768 1.439711 1.19829
H  1.732327 2.467639 -0.268116
H  1.972822 -1.439732 -1.198199
H  1.73239 -2.467635 0.268216
H  2.733512 -0.998922 0.380206
