program: Gaussian 09
title: 000141268
version: EM64L-G09RevD.01
frameworkgroup: C1[X(C10H3F17O4)]
method: RPBEPBE
basis: SDD
operation: Freq
keyword: #p
keyword: freq=noraman
keyword: PBEPBE/SDD
title: #p freq=noraman PBEPBE/SDD
converged: YES YES NO NO
title: Mulliken charges:
elementType: F F F F F F F F F F F F F F F F F O O O O C C C C C C C C C C H H H
charge: -0.105886 -0.131587 -0.114528 -0.118980 -0.119211 -0.119194 -0.122745 -0.110890 -0.122273 -0.124791 -0.121449 -0.128721 -0.123465 -0.124411 -0.126293 -0.116204 -0.126835 -0.272327 -0.245926 -0.217960 -0.173130 0.182126 0.360918 0.360515 0.389525 0.202315 0.203729 0.392769 0.367108 0.228809 -0.489561 0.254114 0.256485 0.257955
chargesum: 0.00000
title: Mulliken charges with hydrogens summed into heavy atoms:
elementType: F F F F F F F F F F F F F F F F F O O O O C C C C C C C C C C
charge: -0.105886 -0.131587 -0.114528 -0.118980 -0.119211 -0.119194 -0.122745 -0.110890 -0.122273 -0.124791 -0.121449 -0.128721 -0.123465 -0.124411 -0.126293 -0.116204 -0.126835 -0.272327 -0.245926 -0.217960 -0.173130 0.182126 0.360918 0.360515 0.389525 0.202315 0.203729 0.392769 0.367108 0.228809 0.278993
polarizability: 1.53062104e+02 1.11202400e+01 1.26737278e+02 -3.92901768e+00 -1.16457635e+00 1.18093698e+02
1716.lowfreq: -5.9662 -2.8904 -0.0007 -0.0005 -0.0002 1.2684 6.0106 17.0136 20.0273
frequency: 5.5062 16.8988 20.0155 23.0337 27.5080 36.6102 43.4817 46.9399 51.0442 65.2897 76.2582 79.5288 86.4357 96.1300 128.8432 141.2619 158.7368 170.7100 178.0844 191.7531 193.0481 201.3461 207.5770 215.6509 224.6952 236.1104 251.8958 262.7419 269.2065 277.8966 282.2201 296.9759 299.4986 301.8670 311.7672 322.8054 331.1995 333.5980 394.9208 405.1534 437.7736 454.5095 460.9424 468.7323 475.7776 483.2975 486.5856 502.8443 515.1630 530.0254 553.1877 569.3919 578.0299 622.8891 647.5481 651.7728 668.4948 684.1775 705.9907 727.6721 754.2333 868.1648 891.9333 895.8054 955.9465 975.9290 983.0310 991.6589 1004.6188 1012.6348 1034.1494 1042.6101 1043.5604 1052.3460 1054.3183 1064.7006 1074.8943 1077.2899 1086.6140 1089.8917 1110.0772 1114.9571 1153.0389 1171.8153 1186.2596 1195.6471 1200.9405 1212.9586 1224.5921 1422.3830 1454.5144 1456.7767 1660.1074 3017.5846 3126.9062 3173.3320
redmass: 7.2760 13.2819 11.9338 17.2780 12.5121 13.1270 14.9045 9.3973 14.6826 16.4488 1.3432 9.1743 8.0533 4.8651 11.3268 16.4014 13.4764 9.5408 9.1920 7.9802 17.4456 17.4496 18.3144 17.0688 17.5887 16.3638 12.1248 15.2564 17.2178 16.0835 18.4772 12.2054 8.9376 15.0398 18.3258 11.4337 17.8015 16.9085 17.4659 17.4385 15.0398 17.0710 17.5460 17.3478 16.9445 17.2275 16.9326 16.9389 17.4424 16.2259 16.2918 16.6312 16.0478 15.8662 15.3343 15.9333 15.8544 13.6861 16.7339 14.2659 7.2804 10.4754 12.9298 13.8409 11.6369 12.8373 13.0726 13.1916 12.8318 12.0706 12.6397 13.1899 13.1196 12.2175 12.9451 13.1106 12.9750 11.3733 12.7883 12.8451 9.1842 1.3159 1.4526 11.5860 12.4422 12.3494 11.5786 10.8544 12.0785 1.1765 1.0491 1.0499 10.6913 1.0292 1.1058 1.1058
irintensity: 1.4729 0.2201 0.3326 0.0136 0.3119 0.2398 0.1552 0.6685 0.2663 0.0486 0.2302 0.1435 0.5673 0.7001 1.5869 0.6628 1.2711 1.4778 1.7055 2.2233 0.8342 2.7174 0.7068 1.1523 3.1332 0.9563 4.4115 0.1398 2.5312 8.3197 1.4900 4.1886 12.5034 1.2425 0.0762 3.0768 1.8986 0.5292 9.1783 6.6975 0.1329 35.8932 3.4148 2.9191 11.4609 8.4325 7.0939 3.2933 2.7047 19.4473 12.5057 30.9005 26.2777 7.6748 14.2927 50.8427 10.6256 0.6063 28.1483 8.4170 21.0182 8.7124 73.4541 193.1460 69.7404 76.1199 81.0470 142.5694 39.4529 31.4997 281.1336 120.1163 53.0343 154.0970 48.4140 110.2710 159.9490 158.8786 233.5737 460.0692 1245.0627 56.5490 13.7420 166.4939 66.9657 57.4103 8.6796 69.5487 85.5862 12.9953 18.2960 13.1177 199.3204 14.5381 13.6109 6.8492
temp: 298.150 k
press: 1.00000 atm
elementType: 9 9 9 9 9 9 9 9 9 9 9 9 9 9 9 9 9 8 8 8 8 6 6 6 6 6 6 6 6 6 6 1 1 1
symmnumber: 1
zpe: 384750.6 jmol-1
zpe.correction: 0.146544 hartree
zpe.thermalcorrener: 0.178652 hartree
zpe.thermalcorrenthalpy: 0.179596 hartree
zpe.thermalcorrgfe: 0.076870 hartree
zpe.sumelectzpe: -2378.597522 hartree
zpe.sumelectthermal: -2378.565414 hartree
zpe.sumelectthermalent: -2378.564470 hartree
zpe.sumelectthermalfe: -2378.667195 hartree
dipole: 3.2886 3.6041 -0.4963
dipole: 4.9041
quadrupole: -162.6006 -162.7098 -179.1039
quadrupole: 17.5438 -2.2678 -4.0751
quadrupole: 5.5375 5.4283 -10.9658 17.5438 -2.2678 -4.0751
hfenergy: -2378.7440654 hartree
pointgroup: C01 [X(C10H3F17O4)]
dipole: -1.3316011 1.1184385 0.8358622 debye
polarizability: 153.6543197|-7.243649|123.4039116|-8.415413|3.9722704|120.834849 unknown
InChI: InChI=1S/C10H3F17O4/c1-29-2(28)3(11,6(15,16)17)30-10(26,27)5(14,8(21,22)23)31-9(24,25)4(12,13)7(18,19)20/h1H3
charge 0 multiplicity 1
34 atoms
F  0.478748 -1.419526 -1.629031
F  -0.668286 0.493068 1.280293
F  -0.338778 -1.730362 1.017645
F  3.287343 -1.048978 -1.487045
F  2.461274 -2.327448 0.18847
F  0.145678 2.135329 -0.882489
F  1.408308 1.124331 -2.472386
F  -0.841375 0.871177 -2.49514
F  3.480084 -0.701552 2.13902
F  5.056413 -1.250718 0.577661
F  -3.145427 -1.269017 1.57275
F  4.495666 1.385583 -0.665517
F  3.301035 1.870361 1.204595
F  5.478501 1.276763 1.378056
F  -4.261104 -0.466455 -1.81045
F  -3.927887 -2.493458 -0.840024
F  -5.486803 -1.077623 -0.000137
O  1.689929 -0.12277 -0.038412
O  -1.900415 -0.673701 -0.34893
O  -4.309257 1.113564 1.696949
O  -2.949776 1.924857 -0.025343
C  0.450088 -0.29597 -0.762024
C  -0.672442 -0.54754 0.311686
C  2.784505 -0.999147 -0.165166
C  0.269964 0.984364 -1.663247
C  3.900388 -0.477905 0.811613
C  -3.149159 -0.510493 0.36598
C  4.291773 1.039652 0.676779
C  -4.21592 -1.151582 -0.588668
C  -3.436902 1.003034 0.650985
C  -4.711865 2.503021 2.064078
H  -5.424872 2.371029 2.887344
H  -5.179511 2.994514 1.195671
H  -3.822919 3.069799 2.384534
