program: Gaussian 09
title: 000141243
version: EM64L-G09RevD.01
frameworkgroup: C1[X(C7H18N2Si)]
method: RPBEPBE
basis: SDD
operation: Freq
keyword: #p
keyword: freq=noraman
keyword: PBEPBE/SDD
title: #p freq=noraman PBEPBE/SDD
converged: YES YES NO NO
title: Mulliken charges:
elementType: Si N N C C C C C C C H H H H H H H H H H H H H H H H H H
charge: 1.300886 -0.435320 -0.063058 0.217320 -1.033843 -1.023977 -1.023380 -0.694393 -0.695690 -0.696610 0.259865 0.239968 0.231440 0.243582 0.233907 0.252076 0.242709 0.251977 0.233018 0.225504 0.198249 0.222281 0.229825 0.220432 0.206952 0.220040 0.206870 0.229371
chargesum: 0.00000
title: Mulliken charges with hydrogens summed into heavy atoms:
elementType: Si N N C C C C C C C
charge: 1.300886 -0.435320 -0.063058 0.217320 -0.302570 -0.294413 -0.295676 -0.048359 -0.038481 -0.040330
polarizability: 1.48022950e+02 3.82573296e+00 1.07510923e+02 -1.00971367e-01 -1.05269414e-02 1.04004244e+02
1716.lowfreq: -23.4010 -17.2822 -8.0374 -1.4248 0.0011 0.0014 0.0017 16.9720 68.3249
frequency: -22.1145 14.5015 68.3060 76.2960 84.0529 115.7656 131.4504 135.4132 171.3344 176.9523 189.6377 214.6776 226.4733 246.1965 284.0366 293.4308 326.2379 334.3807 418.8133 472.3956 474.2799 588.5270 688.9749 701.8563 705.8446 749.4783 761.4762 794.4018 812.9426 823.4506 906.3594 913.0070 920.6706 922.8229 924.3568 945.4910 1006.0929 1022.7744 1187.1531 1219.2921 1259.1108 1295.4400 1295.8986 1306.9900 1364.6678 1368.5827 1390.2084 1435.9627 1442.8308 1443.7874 1446.8793 1448.8726 1450.6687 1454.4687 1459.5300 1461.2689 1464.0151 1465.2536 1474.8855 1490.1266 2979.8943 2982.3392 2985.6688 2986.4012 2987.4832 2989.9068 3079.3779 3082.2784 3084.9981 3087.9890 3089.1379 3089.9693 3091.5172 3091.8728 3093.7410 3094.2381 3094.9844 3096.7302
redmass: 1.2375 2.0597 2.8985 2.9801 2.8693 1.0366 1.0418 1.0754 2.6508 2.5061 2.5498 1.0580 1.9713 1.2497 4.6552 3.3513 2.5978 2.4324 2.9077 3.5776 3.1022 3.9635 5.4911 3.0649 3.0562 1.1714 3.5351 2.1471 1.3448 2.0893 1.5330 1.5396 1.5066 1.5672 1.6560 1.2120 1.3978 1.4653 2.1526 3.0526 3.4425 1.2020 1.2025 1.1891 1.1979 1.2213 1.2328 1.0561 1.0540 1.0507 1.0546 1.0511 1.0617 1.0471 3.8780 1.0816 1.0533 1.0477 1.2106 1.0548 1.0340 1.0345 1.0341 1.0340 1.0340 1.0356 1.1006 1.1000 1.1006 1.0995 1.0985 1.0986 1.0991 1.0984 1.0981 1.0985 1.0984 1.0983
irintensity: 0.1500 0.1045 0.2823 0.1734 0.5178 0.0120 0.0592 0.0464 0.5846 0.3415 0.0609 0.1742 2.8007 1.1144 7.4695 3.8668 5.2736 3.1561 6.7472 5.2396 4.8222 5.5853 3.2136 10.6202 10.0079 0.0852 5.3582 28.9246 19.9725 13.2994 94.7481 86.3837 15.9102 210.2085 2.1539 0.1356 1.0714 1.0775 28.3642 17.1024 10.4857 52.4027 51.1117 12.2207 22.2149 33.9479 4.7467 0.6504 7.2998 0.0661 2.0640 5.2843 6.6306 0.9175 44.2303 28.2115 12.1485 0.5484 6.1097 24.7025 30.4979 25.6050 13.2605 13.8038 14.3958 24.7345 11.0035 5.5243 0.3705 57.4117 3.5584 1.7655 85.7624 11.0035 4.1912 40.8752 15.7282 19.7562
temp: 298.150 k
press: 1.00000 atm
elementType: 14 7 7 6 6 6 6 6 6 6 1 1 1 1 1 1 1 1 1 1 1 1 1 1 1 1 1 1
symmnumber: 1
zpe: 623598.8 jmol-1
zpe.correction: 0.237516 hartree
zpe.thermalcorrener: 0.252870 hartree
zpe.thermalcorrenthalpy: 0.253814 hartree
zpe.thermalcorrgfe: 0.194664 hartree
zpe.sumelectzpe: -675.584707 hartree
zpe.sumelectthermal: -675.569353 hartree
zpe.sumelectthermalent: -675.568409 hartree
zpe.sumelectthermalfe: -675.627560 hartree
dipole: -0.4163 0.1923 0.0286
dipole: 0.4595
quadrupole: -64.2030 -74.2192 -70.6645
quadrupole: -0.1736 -0.0938 -0.1293
quadrupole: 5.4926 -4.5236 -0.9690 -0.1736 -0.0938 -0.1293
hfenergy: -675.8222232 hartree
pointgroup: C01 [X(C7H18N2Si1)]
dipole: -0.1626776 -0.0022746 0.0788178 debye
polarizability: 148.1067963|1.043307|104.0890466|3.1904044|0.5085441|107.3422731 unknown
InChI: InChI=1S/C7H18N2Si/c1-7(2,3)8-9-10(4,5)6/h1-6H3
charge 0 multiplicity 1
28 atoms
Si -2.075853 -0.008475 0.060329
N  -0.284636 -0.033619 -0.481497
N  0.612549 0.061485 0.438315
C  2.064326 0.021491 -0.058761
C  -2.266686 0.352752 1.924896
C  -2.708716 -1.74463 -0.413142
C  -2.859705 1.335512 -1.039875
C  2.206488 -0.153808 -1.581513
C  2.665132 1.367162 0.423546
C  2.700725 -1.158421 0.718061
H  -1.505303 -0.210396 2.494199
H  -2.116589 1.42602 2.138958
H  -3.268716 0.062357 2.290406
H  -2.298313 -2.516256 0.262789
H  -3.811852 -1.793758 -0.362171
H  -2.400524 -1.993066 -1.444491
H  -2.47587 2.337907 -0.777722
H  -2.621771 1.145758 -2.101736
H  -3.959327 1.350108 -0.928408
H  1.700464 0.662945 -2.124438
H  3.277369 -0.159509 -1.856504
H  1.745813 -1.099216 -1.917107
H  2.477316 1.50959 1.502466
H  2.216679 2.216087 -0.12325
H  3.756583 1.377735 0.250446
H  2.281068 -2.123294 0.38048
H  3.793237 -1.176179 0.551786
H  2.510012 -1.056182 1.801039
