program: Gaussian 09
title: 000141237
version: EM64L-G09RevD.01
frameworkgroup: C1[X(C17H12S3)]
method: RPBEPBE
basis: SDD
operation: Freq
keyword: #pfreq=noraman
keyword: PBEPBE/SDD
title: #p freq=noraman PBEPBE/SDD
converged: YES YES NO NO
title: Mulliken charges:
elementType: S S S C C C C C C C C C C C C C C C C C H H H H H H H H H H H H
charge: 0.081381 0.093358 0.093379 -0.560890 0.605539 0.606129 0.335097 0.334792 -0.773282 -0.773507 -0.384577 -0.414148 -0.414188 -0.384534 -0.217066 -0.233728 -0.233853 -0.217002 -0.240728 -0.240819 0.292383 0.292288 0.247272 0.247930 0.247923 0.247224 0.226784 0.226123 0.226154 0.226779 0.228879 0.228906
chargesum: 0.00000
title: Mulliken charges with hydrogens summed into heavy atoms:
elementType: S S S C C C C C C C C C C C C C C C C C
charge: 0.081381 0.093358 0.093379 -0.560890 0.605539 0.606129 0.335097 0.334792 -0.480899 -0.481218 -0.137305 -0.166217 -0.166265 -0.137311 0.009718 -0.007605 -0.007699 0.009777 -0.011849 -0.011913
polarizability: 3.19529517e+02 -2.32370899e-02 2.87947796e+02 2.65923683e-03 -4.13249169e+01 1.53088280e+02
1716.lowfreq: -0.0006 0.0009 0.0016 2.4530 4.2749 11.8905 26.3699 52.4330 60.8081
frequency: 26.3659 52.4145 60.8039 77.3194 87.5088 92.8071 122.0224 146.0672 201.2015 206.8897 244.3896 273.2704 286.6665 299.9707 315.6615 329.3694 360.7712 374.4774 403.8799 405.9444 415.2162 485.8747 522.9481 587.8893 612.5242 614.7092 619.9902 632.1728 632.4947 686.4544 701.3938 704.6141 759.3267 760.3331 792.3550 843.4036 846.6767 853.9361 858.2984 860.3167 875.1608 883.0760 921.3035 929.7144 973.7959 977.3142 988.8171 989.4696 993.9538 995.4410 1024.5914 1028.1272 1077.5360 1082.1439 1082.3280 1160.3473 1172.8650 1173.2903 1189.0242 1190.4281 1245.6174 1247.1523 1311.2958 1311.9874 1344.2356 1371.3074 1373.7385 1400.0583 1410.0680 1430.4008 1440.0010 1467.6561 1485.3735 1489.7905 1584.4793 1585.0400 1608.7222 1609.4464 3120.7952 3121.0650 3127.0817 3127.8066 3139.2771 3139.9920 3149.1689 3149.9813 3151.3751 3152.0036 3165.3294 3165.8567
redmass: 7.2425 4.0794 5.4534 3.7068 5.8070 6.4699 9.3889 5.7882 7.9849 7.0803 9.3201 5.0430 4.9900 7.6156 6.3323 9.4102 11.4063 8.3992 2.8293 2.9269 7.3288 4.1539 3.5208 4.6726 8.1807 6.4897 5.4029 6.0648 7.4409 6.5662 1.7579 1.8565 1.9846 1.9128 5.6538 2.2172 1.2628 1.4369 1.4795 1.8798 3.4839 5.5354 1.4745 1.5304 1.3910 1.3877 5.9569 6.1565 1.3232 1.3124 2.6275 2.2024 2.4546 1.7008 1.5911 2.8991 1.0521 1.0523 1.1150 1.1140 1.4867 1.6544 1.4364 1.4048 2.5940 5.9468 7.0940 5.7880 3.7358 2.3581 2.6334 3.7966 2.5558 3.2152 6.0554 6.0861 6.1401 6.1274 1.0863 1.0862 1.0864 1.0869 1.0919 1.0921 1.0963 1.0962 1.0903 1.0902 1.1016 1.1017
irintensity: 0.0089 0.0630 0.1127 0.0359 0.0705 0.0319 1.0694 0.7685 7.6264 0.1164 0.0010 0.8036 0.5946 0.0861 16.6120 64.1542 0.0114 3.7432 0.0004 0.4339 4.9354 0.6978 15.8910 3.1061 16.0670 0.2463 0.0048 0.7797 2.5532 7.5744 86.1728 1.8398 14.2500 98.5830 11.9867 65.1084 0.0870 4.4773 0.8642 17.0629 22.9414 9.3603 0.2265 0.1045 0.1319 0.4879 0.2942 1.4826 0.0299 0.0002 3.8032 3.4469 6.4350 6.7361 11.9676 12.7266 0.0217 0.0159 1.8050 0.0165 12.2147 0.3394 2.2441 13.6574 8.8217 9.5618 0.9861 143.7004 34.0228 1.1907 23.8186 2.0807 5.7977 47.9902 6.4956 0.3332 1.9928 6.8769 5.1084 4.9779 0.1539 0.0404 11.2212 15.7969 6.4333 45.8041 5.0130 3.8591 9.6439 37.5899
temp: 298.150 k
press: 1.00000 atm
elementType: 16 16 16 6 6 6 6 6 6 6 6 6 6 6 6 6 6 6 6 6 1 1 1 1 1 1 1 1 1 1 1 1
symmnumber: 1
zpe: 611851.4 jmol-1
zpe.correction: 0.233042 hartree
zpe.thermalcorrener: 0.250416 hartree
zpe.thermalcorrenthalpy: 0.251360 hartree
zpe.thermalcorrgfe: 0.186651 hartree
zpe.sumelectzpe: -1847.820654 hartree
zpe.sumelectthermal: -1847.803280 hartree
zpe.sumelectthermalent: -1847.802336 hartree
zpe.sumelectthermalfe: -1847.867045 hartree
dipole: 4.5510 -0.0051 0.0017
dipole: 4.5510
quadrupole: -136.6268 -136.3997 -132.6882
quadrupole: 0.0173 0.0002 -5.3877
quadrupole: -1.3886 -1.1614 2.5500 0.0173 0.0002 -5.3877
hfenergy: -1848.0536958 hartree
pointgroup: C01 [X(C17H12S3)]
dipole: -1.7903637 0.021644 0.009523 debye
polarizability: 319.525873|-0.183528|282.2294395|-0.2697682|49.4641664|158.8102807 unknown
InChI: InChI=1S/C17H12S3/c18-11-15(13-7-3-1-4-8-13)17(20)16(12-19)14-9-5-2-6-10-14/h1-12H
charge 0 multiplicity 1
32 atoms
S  3.698273 -0.04638 0.024272
S  3.643827 -2.468939 -0.715152
S  3.717609 2.380993 0.757785
C  1.863368 -0.020864 0.033569
C  1.187304 -1.289275 -0.127102
C  1.223916 1.265324 0.200324
C  -0.257713 -1.51283 0.213808
C  -0.218303 1.528004 -0.123948
C  1.915217 -2.43117 -0.492156
C  1.986515 2.387968 0.554754
C  -0.75871 -1.152163 1.492195
C  -1.041374 2.24917 0.78053
C  -1.110195 -2.211307 -0.681207
C  -0.743541 1.181412 -1.396477
C  -2.08268 -1.472851 1.859862
C  -2.359915 2.608237 0.426936
C  -2.43372 -2.535062 -0.312462
C  -2.062571 1.53746 -1.749048
C  -2.926004 -2.16594 0.960494
C  -2.876754 2.2526 -0.840146
H  1.391671 -3.38643 -0.604375
H  1.489273 3.356782 0.670856
H  -0.102589 -0.637141 2.202403
H  -0.649851 2.514237 1.769979
H  -0.737296 -2.486303 -1.675075
H  -0.109911 0.648655 -2.114029
H  -2.453588 -1.189794 2.85123
H  -2.982987 3.159797 1.139801
H  -3.079773 -3.06935 -1.017968
H  -2.452137 1.264504 -2.736083
H  -3.95303 -2.415879 1.248849
H  -3.89993 2.530136 -1.11662
