program: Gaussian 09
title: 000141227
version: EM64L-G09RevD.01
frameworkgroup: C1[X(C19H14O)]
method: RPBEPBE
basis: SDD
operation: Freq
keyword: #pfreq=noraman
keyword: PBEPBE/SDD
title: #p freq=noraman PBEPBE/SDD
converged: YES YES NO NO
title: Mulliken charges:
elementType: O C C C C C C C C C C C C C C C C C C C H H H H H H H H H H H H H H
charge: -0.452296 -0.172026 0.237270 0.222284 0.142976 0.156703 0.413186 -0.401735 -0.402101 -0.396963 -0.401612 -0.378347 -0.412325 -0.230595 -0.233183 -0.233666 -0.233410 -0.229137 -0.220067 -0.248702 0.261628 0.264061 0.241201 0.241267 0.351373 0.241955 0.285460 0.228782 0.229313 0.227362 0.227293 0.224025 0.223936 0.226092
chargesum: 0.00000
title: Mulliken charges with hydrogens summed into heavy atoms:
elementType: O C C C C C C C C C C C C C C C C C C C
charge: -0.100923 -0.172026 0.237270 0.222284 0.142976 0.156703 0.413186 -0.140107 -0.138041 -0.155762 -0.160345 -0.136393 -0.126866 -0.001813 -0.003869 -0.006304 -0.006117 -0.005112 0.003869 -0.022611
polarizability: 2.35875587e+02 4.69503729e+00 2.33522517e+02 2.33620010e+01 2.07475219e+00 1.41311933e+02
1716.lowfreq: -0.0008 -0.0007 0.0005 4.2770 4.9510 8.5868 22.8630 51.0080 55.8799
frequency: 22.7076 50.9870 55.8628 93.8134 134.0425 181.6917 193.5754 218.9612 232.2483 293.2321 305.3909 330.7622 344.8744 401.9397 408.8885 413.6059 437.3958 459.1917 507.0875 512.8240 566.9613 581.5044 615.5933 616.7249 636.0757 637.8017 696.0324 704.6832 736.2850 750.5814 752.0156 767.0465 770.2549 790.8980 857.5219 876.7760 882.6715 891.0892 899.2635 940.5559 952.6551 954.3638 979.8793 982.4748 987.6190 989.3699 990.4993 995.4001 999.1665 1019.1000 1027.9413 1030.6766 1080.1559 1098.0462 1102.6515 1154.3629 1165.2128 1168.5661 1171.1999 1179.1397 1184.5111 1189.5422 1234.3626 1283.8744 1293.2811 1302.8767 1327.7036 1371.1485 1383.1155 1404.7654 1434.2362 1436.8644 1443.4056 1462.4650 1480.5762 1483.4160 1591.6459 1593.5261 1595.4142 1611.9885 1615.4618 1616.3096 3120.0332 3124.5473 3125.6483 3128.0293 3135.0797 3136.6537 3141.2967 3147.2036 3148.5049 3158.3298 3163.2087 3163.9547 3177.6170 3562.6099
redmass: 3.8622 4.5495 4.9295 4.6062 3.8667 4.8281 3.8879 4.8014 4.6353 4.9414 2.2453 1.5955 4.8646 2.8445 5.1709 3.9029 4.6096 3.4016 5.1002 3.5220 3.4013 4.7215 6.9836 6.4156 5.9842 5.6799 6.1007 1.8160 3.6060 2.9413 1.9338 1.6237 1.7115 2.4621 1.2514 1.4411 1.4994 3.2679 3.2425 1.7650 1.4495 1.4381 6.3062 1.3925 1.3349 1.4853 4.1839 6.1443 1.3268 2.2331 2.1908 1.9652 1.7330 1.9499 1.8000 1.9993 1.3709 1.1746 1.0619 1.6681 1.8834 1.2063 1.9660 1.5006 1.8321 1.7365 1.4710 9.4354 9.0107 3.3129 2.2351 2.2298 2.7938 2.5760 2.6021 3.3991 6.5457 7.0165 6.5296 6.2445 7.3321 6.9842 1.0848 1.0855 1.0854 1.0885 1.0894 1.0897 1.0941 1.0947 1.0948 1.0991 1.1003 1.1003 1.0953 1.0660
irintensity: 0.0742 0.0116 0.0952 1.9567 0.2526 0.1572 2.1718 0.2080 0.2687 5.5077 27.4211 86.3060 5.7076 0.7719 3.5178 6.0024 1.2357 3.0100 0.8825 0.7745 0.0548 6.4566 2.4510 0.0466 20.8497 15.2602 0.6069 45.5895 29.1194 34.4170 20.1770 85.2557 67.3934 1.5170 0.2605 4.7327 0.7198 8.7174 32.6072 0.6028 2.1681 1.1032 45.9578 0.7665 0.0792 0.8023 0.2906 3.2039 0.2338 2.1073 11.1738 4.3710 2.1420 4.3164 2.1598 48.5145 1.9661 3.0048 1.0409 0.6130 1.5924 4.9070 1.6082 6.0836 13.4092 5.1302 31.6538 5.5992 2.3148 0.7772 20.9333 35.6993 7.2675 5.0101 14.1073 7.8001 0.2529 0.3339 1.2574 8.8483 5.9028 2.5361 2.5563 3.2496 0.3027 5.8311 8.1044 2.5909 35.7014 8.4662 36.7811 28.8490 58.1641 8.9347 7.0039 12.3914
temp: 298.150 k
press: 1.00000 atm
elementType: 8 6 6 6 6 6 6 6 6 6 6 6 6 6 6 6 6 6 6 6 1 1 1 1 1 1 1 1 1 1 1 1 1 1
symmnumber: 1
zpe: 702035.1 jmol-1
zpe.correction: 0.267391 hartree
zpe.thermalcorrener: 0.282696 hartree
zpe.thermalcorrenthalpy: 0.283640 hartree
zpe.thermalcorrgfe: 0.224192 hartree
zpe.sumelectzpe: -806.304407 hartree
zpe.sumelectthermal: -806.289102 hartree
zpe.sumelectthermalent: -806.288158 hartree
zpe.sumelectthermalfe: -806.347605 hartree
dipole: -1.6174 0.1367 -0.6218
dipole: 1.7382
quadrupole: -103.6378 -106.0631 -113.9513
quadrupole: 0.9163 1.7008 1.2070
quadrupole: 4.2463 1.8210 -6.0673 0.9163 1.7008 1.2070
hfenergy: -806.5717977 hartree
pointgroup: C01 [X(C19H14O1)]
dipole: -0.634494 -0.0242486 0.2539139 debye
polarizability: 234.6677155|-4.425925|233.9103444|-24.6866051|4.5201535|142.1319766 unknown
InChI: InChI=1S/C19H14O/c20-19(14-8-2-1-3-9-14)17-12-6-4-10-15(17)16-11-5-7-13-18(16)19/h1-13,20H
charge 0 multiplicity 1
34 atoms
O  0.492873 -0.002742 -2.306902
C  0.28326 0.002539 -0.837736
C  -0.570156 -1.203158 -0.389222
C  -0.604365 1.183436 -0.403353
C  -1.782747 -0.764419 0.216432
C  -1.804942 0.71726 0.205703
C  1.681668 0.008895 -0.203827
C  -0.282377 -2.569067 -0.527852
C  -0.35879 2.555337 -0.563253
C  -2.72176 -1.703015 0.692449
C  -2.773364 1.633933 0.665641
C  1.820805 0.234494 1.189234
C  2.835493 -0.244597 -0.982626
C  -1.228462 -3.514225 -0.054185
C  -1.333746 3.478481 -0.10512
C  -2.434846 -3.082975 0.551536
C  -2.527913 3.019757 0.504888
C  3.095418 0.208111 1.793668
C  4.112909 -0.267486 -0.375649
C  4.2486 -0.043637 1.012711
H  0.655966 -2.896522 -0.98798
H  0.568392 2.902978 -1.030837
H  -3.656851 -1.379309 1.163081
H  -3.69949 1.289015 1.13895
H  -0.398927 -0.029739 -2.738529
H  0.932215 0.435913 1.799287
H  2.720513 -0.408232 -2.057144
H  -1.024336 -4.586201 -0.152522
H  -1.162634 4.554507 -0.220542
H  -3.152607 -3.826658 0.915788
H  -3.26901 3.746626 0.856199
H  3.190782 0.385239 2.870999
H  5.000737 -0.459603 -0.98911
H  5.238894 -0.062036 1.48182
