program: Gaussian 09
title: 000141215
version: EM64L-G09RevD.01
frameworkgroup: C1[X(C9H14O)]
method: RPBEPBE
basis: SDD
operation: Freq
keyword: #pfreq=noraman
keyword: PBEPBE/SDD
title: #p freq=noraman PBEPBE/SDD
converged: YES YES NO NO
title: Mulliken charges:
elementType: O C C C C C C C C C H H H H H H H H H H H H H H
charge: -0.299399 0.287313 -0.187106 -0.491270 -0.493584 -0.437479 -0.449504 -0.263989 -0.220780 -0.544358 0.214135 0.221613 0.242569 0.228346 0.222081 0.225378 0.202887 0.207643 0.221557 0.238149 0.228922 0.205270 0.231251 0.210357
chargesum: 0.00000
title: Mulliken charges with hydrogens summed into heavy atoms:
elementType: O C C C C C C C C C
charge: -0.299399 0.287313 0.027028 -0.027088 -0.043157 -0.009215 -0.020304 -0.025840 0.008142 0.102520
polarizability: 1.08702534e+02 8.38346121e-01 8.10730921e+01 3.36038682e-02 -1.60807438e+00 8.45726771e+01
1716.lowfreq: -11.8682 -0.0001 0.0005 0.0006 17.5669 28.3536 107.5563 133.5509 172.1440
frequency: 107.4218 133.5241 172.1357 213.5002 265.0569 327.3186 343.6940 388.8553 414.8165 434.8523 530.9255 568.5289 619.7122 686.5495 692.2674 797.8248 801.3634 824.9614 872.5878 909.4401 935.2644 962.8632 964.0743 983.9684 994.5777 1028.0285 1053.6191 1069.8757 1083.5916 1104.5351 1112.3307 1140.1457 1156.8870 1172.1149 1198.5827 1207.3974 1234.6354 1258.3600 1268.8929 1280.2588 1309.0750 1318.0253 1333.5288 1362.4053 1434.6164 1459.3244 1464.2120 1473.6186 1474.3301 1480.1260 1489.5826 1620.2486 2941.8866 2986.4316 2990.2540 3002.2532 3012.5774 3019.4871 3039.0807 3042.6376 3048.8862 3067.1847 3080.3821 3094.9730 3124.8628 3157.3145
redmass: 1.9936 1.8013 1.5588 1.9427 2.0548 2.5379 2.4799 2.9473 3.2059 3.7786 4.6228 4.6629 2.9207 2.9305 1.9324 2.7104 1.2928 1.4830 3.6519 2.3034 1.3351 1.9261 2.0098 6.4480 2.0963 2.5378 2.4207 3.4362 1.8988 1.4203 1.2922 1.2627 1.3669 1.4834 1.3504 1.3560 1.3083 1.4280 1.3655 1.4210 1.5496 1.3392 1.5433 1.8567 1.1317 1.0641 1.0697 1.0807 1.0862 1.0514 1.0979 6.3712 1.0329 1.0592 1.0604 1.0624 1.0624 1.1014 1.0882 1.1019 1.1021 1.1042 1.1037 1.0983 1.0861 1.1047
irintensity: 4.4795 0.3631 2.2342 1.5971 3.9880 4.5021 3.1991 1.0603 1.4461 1.1502 5.1203 0.3014 0.2336 20.4404 34.1832 1.2622 3.6202 3.5011 3.3398 10.4294 0.1039 1.7821 6.5144 15.5035 10.9916 3.3859 2.8098 71.8370 21.7218 8.0016 0.9846 12.3167 10.6288 7.3620 2.7537 1.4871 1.1333 2.0584 8.5583 1.0368 10.2622 0.7963 12.4045 17.5829 2.4729 5.3715 4.4472 4.3430 8.4980 13.7276 3.3450 5.4739 64.7425 42.2073 28.0774 44.7866 44.7520 76.8189 58.2179 8.8638 11.0517 48.7109 48.6341 36.7368 10.4186 26.7925
temp: 298.150 k
press: 1.00000 atm
elementType: 8 6 6 6 6 6 6 6 6 6 1 1 1 1 1 1 1 1 1 1 1 1 1 1
symmnumber: 1
zpe: 551135.4 jmol-1
zpe.correction: 0.209916 hartree
zpe.thermalcorrener: 0.219108 hartree
zpe.thermalcorrenthalpy: 0.220052 hartree
zpe.thermalcorrgfe: 0.176413 hartree
zpe.sumelectzpe: -425.752485 hartree
zpe.sumelectthermal: -425.743293 hartree
zpe.sumelectthermalent: -425.742349 hartree
zpe.sumelectthermalfe: -425.785988 hartree
dipole: -0.6468 -1.4455 -0.0337
dipole: 1.5840
quadrupole: -57.5384 -63.0295 -59.7472
quadrupole: -3.6489 1.1378 -0.1940
quadrupole: 2.5667 -2.9245 0.3578 -3.6489 1.1378 -0.1940
hfenergy: -425.9624014 hartree
pointgroup: C01 [X(C9H14O1)]
dipole: 0.2616334 0.556565 -0.1006609 debye
dipolederiv: -1.0685464 0.1255624 0.0148328 0.1168331 -0.4180639 0.0175059 0.0117634 0.0055733 -0.4559557 0.9007852 0.0239427 0.0283059 0.16848 0.2138641 -0.0705596 0.0341481 -0.057806 0.3110525 0.2201511 0.0267147 0.000183 0.0329078 0.064207 -0.0543219 0.0039349 -0.0422333 -0.023996 -0.1070698 0.0159252 -0.0345671 0.0568756 0.0256308 0.0067505 -0.0364419 -0.0303034 0.1060821 -0.1219111 -0.0507734 0.0005557 -0.164088 0.0220205 0.0721333 0.0306598 0.0980162 -0.0015506 0.0400135 -0.0322691 0.0149644 -0.048655 0.047707 0.0117296 0.0433455 -0.0153142 0.1328183 0.0298471 0.01892 -0.0162891 0.0369366 0.1268086 0.0137045 -0.001488 0.0420056 0.0968818 -0.1604891 0.081613 0.0376437 0.0190944 -0.2167254 0.1212036 -0.0565684 0.0957022 -0.0307252 -0.0033396 0.0076994 -0.0924989 0.0169548 -0.2158849 0.1421273 -0.0709276 0.1558033 0.0926534 0.4868979 -0.1176487 0.0141681 -0.3023117 0.3375031 -0.0129729 0.0235694 -0.0023411 0.3329686 -0.2078884 -0.0591745 -0.0236199 -0.0650423 0.0277484 -0.0024083 -0.0348855 -0.0037334 0.0473887 0.0507304 -0.0296391 -0.0328136 -0.0386213 0.0149483 -0.0744631 -0.0726061 -0.1177585 -0.1006812 0.040385 -0.0559231 0.0251913 -0.0330701 -0.0341287 0.0838566 0.0508473 0.1251 -0.0233468 -0.0282308 0.0973306 -0.0297342 0.1245928 -0.0934166 0.0167734 0.0158573 -0.0050235 0.0585453 0.0386597 -0.0182542 -0.0453578 -0.0352229 0.0279002 -0.0938967 -0.0851791 -0.0599835 -0.1183479 -0.0227839 0.0549539 -0.0568283 0.0469739 -0.0255293 0.0811859 -0.1183839 0.118439 -0.0479795 -0.0240193 0.0347273 0.0756437 0.047403 0.0253859 -0.0597308 0.1492828 -0.0922707 -0.1027648 -0.0242372 0.0079149 0.0848395 0.0445453 0.0589428 -0.0738737 0.1294679 -0.0201375 -0.1329701 0.0145708 -0.0235235 0.0029767 -0.0635678 -0.1848014 0.0376551 -0.0276448 -0.017796 0.0665456 0.0061627 0.0079341 0.1150961 -0.0125246 0.1429257 -0.06123 0.0940683 -0.0644534 -0.0164024 0.0162509 -0.0534415 -0.0665376 -0.0454936 0.1276623 -0.1135948 -0.052517 -0.115273 -0.0714617 0.0483499 -0.0255144 -0.0616851 0.0739434 -0.0779492 -0.1188704 -0.0140842 -0.1389023 -0.0882544 -0.1658886 -0.0547584 0.0293686 -0.0982812 0.0473247 0.019654 0.0383282 0.0155649 0.0994283 0.0416002 0.0176814 0.0161621 0.121338 -0.0440798 0.1116427 -0.0545465 0.1271251 -0.1299283 unknown
polarizability: 108.7150947|0.4448039|81.6054535|-0.4032999|2.04916|84.027755 unknown
InChI: InChI=1S/C9H14O/c1-10-9-5-2-8(3-6-9)4-7-9/h2,5,8H,3-4,6-7H2,1H3
charge 0 multiplicity 1
24 atoms
O  -2.028224 -0.648894 -0.014225
C  -0.618779 -0.222763 -0.009699
C  1.919944 0.342817 0.10246
C  0.209138 -1.532206 -0.183319
C  -0.24875 0.727177 -1.197721
C  1.733294 -1.199547 -0.108843
C  1.27886 1.062157 -1.131231
C  -0.186996 0.441934 1.289175
C  1.141016 0.738323 1.347271
C  -3.013869 0.431901 0.031061
H  2.992454 0.594586 0.181377
H  -0.065574 -1.985004 -1.153435
H  -0.09333 -2.238576 0.608426
H  -0.845988 1.654219 -1.139217
H  -0.510802 0.218556 -2.144684
H  2.214073 -1.746673 0.721476
H  2.247017 -1.500518 -1.041887
H  1.792372 0.724342 -2.051552
H  1.437188 2.152256 -1.047702
H  -0.900987 0.610469 2.102928
H  1.627554 1.194876 2.216246
H  -2.821318 1.140568 0.862939
H  -3.985635 -0.061652 0.193953
H  -3.052458 1.000349 -0.920099
