program: Gaussian 09
title: 000141201
version: EM64L-G09RevD.01
frameworkgroup: C1[X(C8H12)]
method: RPBEPBE
basis: SDD
operation: Freq
keyword: #p
keyword: freq=noraman
keyword: PBEPBE/SDD
title: #p freq=noraman PBEPBE/SDD
converged: YES YES NO NO
title: Mulliken charges:
elementType: C C C C C C C C H H H H H H H H H H H H
charge: 0.382300 0.382297 -0.614400 -0.614397 -0.567813 -0.563656 -0.567802 -0.563665 0.217895 0.210982 0.210979 0.217896 0.233548 0.233548 0.233798 0.233798 0.233546 0.233547 0.233798 0.233799
chargesum: 0.00000
title: Mulliken charges with hydrogens summed into heavy atoms:
elementType: C C C C C C C C
charge: 0.382300 0.382297 -0.185523 -0.185522 -0.100717 -0.096060 -0.100709 -0.096068
polarizability: 9.48603091e+01 5.23863854e-07 7.08180433e+01 -4.28909928e-05 1.83636154e-04 7.31910817e+01
1716.lowfreq: -10.1940 -0.0006 -0.0003 0.0001 9.7619 17.2331 27.4951 215.4904 228.6155
frequency: 27.4951 215.4828 228.6154 306.5421 311.7601 360.1581 391.4689 420.8339 637.3066 765.6168 770.1579 799.6217 799.9899 837.8398 840.8801 884.9342 888.0406 888.2310 945.9700 971.1018 982.2009 1023.9327 1029.1861 1053.6957 1057.4333 1072.8934 1097.1059 1151.4674 1152.3410 1177.2460 1189.7358 1199.0444 1224.2338 1249.5943 1348.8723 1382.6131 1433.8319 1434.3084 1446.6423 1463.3476 1463.8370 1476.0636 2988.3889 2993.9320 3054.2255 3056.9098 3078.3403 3078.4527 3087.4997 3087.8120 3173.9799 3174.1260 3192.2247 3192.2812
redmass: 2.9906 2.6507 1.9181 3.1164 1.7460 2.2558 1.7833 4.2137 3.3100 1.0383 1.0317 1.2275 2.8034 3.0805 4.7757 1.5804 1.2353 1.6556 3.4827 1.3415 3.5839 1.2530 1.2760 1.6014 1.3894 1.0180 2.3439 1.3025 1.3109 1.3731 2.5892 1.3613 1.4077 3.1228 3.0556 2.0749 1.0863 1.0864 1.0835 1.1064 1.3722 1.8307 1.0578 1.0606 1.1056 1.1076 1.0507 1.0506 1.0623 1.0622 1.1165 1.1168 1.1146 1.1144
irintensity: 0.0044 0.0927 0.0000 0.0256 0.0054 0.0000 2.3693 0.2365 3.1569 4.4164 0.0000 0.0074 8.0605 0.3996 1.6523 0.0000 0.0000 0.1365 21.2714 0.0022 0.1746 41.0961 0.3669 1.1733 0.1937 0.0000 26.1115 0.0000 0.0010 0.2715 0.0000 2.7211 0.0000 2.6313 1.5400 0.0440 14.6571 0.0694 7.9944 0.0047 11.5684 0.0019 93.4319 1.2486 0.8950 52.4918 0.3729 61.7432 29.2806 0.2705 0.0000 0.0414 0.0007 60.9711
temp: 298.150 k
press: 1.00000 atm
elementType: 6 6 6 6 6 6 6 6 1 1 1 1 1 1 1 1 1 1 1 1
symmnumber: 1
zpe: 457929.6 jmol-1
zpe.correction: 0.174416 hartree
zpe.thermalcorrener: 0.182221 hartree
zpe.thermalcorrenthalpy: 0.183165 hartree
zpe.thermalcorrgfe: 0.141868 hartree
zpe.sumelectzpe: -311.330544 hartree
zpe.sumelectthermal: -311.322739 hartree
zpe.sumelectthermalent: -311.321795 hartree
zpe.sumelectthermalfe: -311.363092 hartree
dipole: 0.0000 0.0000 -0.0084
dipole: 0.0084
quadrupole: -52.4071 -46.7435 -49.3551
quadrupole: 0.0000 0.0000 -0.0001
quadrupole: -2.9052 2.7584 0.1468 0.0000 0.0000 -0.0001
hfenergy: -311.5049597 hartree
pointgroup: C01 [X(C8H12)]
dipole: 0. -0.0032996 -0.0000025 debye
dipolederiv: 0.0144453 -0.0397511 0.0000102 -0.0101159 0.2385628 -0.0000407 0.0000035 -0.0000408 0.083831 0.0144502 0.0397631 -0.0000124 0.0101223 0.2385639 -0.0000426 -0.0000021 -0.0000416 0.0838296 -0.0420095 -0.0000138 -0.000002 -0.000017 0.1595521 -0.0008664 -0.0000031 -0.0102707 0.0645161 -0.0420061 -0.0000139 -0.0000011 -0.0000166 0.159562 0.0008198 -0.0000005 0.0102233 0.0645097 -0.084514 -0.055819 0.0000119 -0.1378551 -0.1415762 0.0000607 0.0000332 0.0000613 0.0953051 -0.1343932 0.063626 -0.000019 0.1490472 -0.1168513 0.0000565 -0.0000416 0.0000564 0.0973743 -0.0845269 0.0558154 -0.0000088 0.1378566 -0.1415791 0.0000655 -0.0000314 0.0000619 0.0953097 -0.1343784 -0.0636339 0.0000273 -0.1490465 -0.1168506 0.0000547 0.0000474 0.0000576 0.0973699 0.003279 0.0000045 -0.0000087 0.0000026 -0.0626547 0.1577617 -0.000004 0.0875536 -0.066585 -0.0025356 0.0000092 0.0000112 0.0000071 -0.0963681 -0.1519021 0.0000051 -0.0900885 -0.036261 -0.0025364 0.0000065 -0.0000086 0.0000043 -0.0962485 0.1519323 -0.0000045 0.0901181 -0.0363838 0.0032788 0.0000068 0.000011 0.0000057 -0.0627793 -0.1577637 0.0000053 -0.087557 -0.0664616 0.0694112 -0.046065 -0.0211113 -0.0621412 -0.0032931 -0.0635604 -0.0629117 -0.1011125 -0.0600901 0.0694096 -0.0460565 0.0211391 -0.0621101 -0.0032068 0.0635289 0.0629472 0.1010816 -0.0601745 0.0534504 0.0553555 0.0293258 0.0699873 0.0128771 -0.0596493 0.0752343 -0.0936609 -0.058915 0.053453 0.0553378 -0.0293511 0.0699463 0.0129562 0.0596139 -0.0752679 0.0936252 -0.0589972 0.0694084 0.0460575 -0.0211405 0.0621121 -0.0032005 0.0635263 -0.0629499 0.1010784 -0.0601804 0.0694086 0.0460656 0.0211094 0.0621429 -0.0032934 -0.0635611 0.0629112 -0.1011107 -0.0600885 0.0534564 -0.0553365 0.0293485 -0.0699436 0.0129528 0.0596153 0.0752651 0.0936283 -0.0589972 0.0534492 -0.0553584 -0.0293307 -0.0699884 0.0128749 -0.0596493 -0.0752356 -0.093663 -0.0589111 unknown
polarizability: 94.8603091|0.0005475|73.1910815|0.0000907|-0.0007076|70.8180435 unknown
InChI: InChI=1S/C8H12/c1-2-7(1)5-8(6-7)3-4-8/h1-6H2
charge 0 multiplicity 1
20 atoms
C  1.080174 -0.009994 -0.000011
C  -1.080184 -0.010087 -0.000032
C  0.000007 -0.06067 -1.115626
C  -0.000014 -0.060095 1.115608
C  2.343017 0.845581 -0.000219
C  2.441882 -0.695162 0.000183
C  -2.343048 0.845464 -0.000242
C  -2.441874 -0.695282 0.000168
H  -0.000033 0.798169 -1.811401
H  0.000063 -0.998306 -1.702241
H  0.000031 -0.997436 1.702697
H  -0.000065 0.799093 1.810952
H  2.609721 1.377024 0.919502
H  2.609744 1.376543 -0.920211
H  2.775131 -1.188063 -0.919248
H  2.775108 -1.187586 0.919879
H  -2.609789 1.376403 -0.920243
H  -2.609765 1.376912 0.919472
H  -2.775078 -1.187714 0.919868
H  -2.775127 -1.188194 -0.919256
