program: Gaussian 09
title: 000141193
version: EM64L-G09RevD.01
frameworkgroup: C1[X(C11H13NS)]
method: RPBEPBE
basis: SDD
operation: Freq
keyword: #p
keyword: freq=noraman
keyword: PBEPBE/SDD
title: #p freq=noraman PBEPBE/SDD
converged: NO NO NO NO
title: Mulliken charges:
elementType: S N C C C C C C C C C C C H H H H H H H H H H H H H
charge: 0.123861 0.344282 0.409086 0.408766 0.082266 -0.536506 -0.536528 -0.420029 -0.420033 -0.238565 -0.674010 -0.674007 -0.815381 0.216656 0.225109 0.225101 0.216730 0.241767 0.241781 0.229528 0.231235 0.222876 0.220955 0.220944 0.222891 0.231225
chargesum: 0.00000
title: Mulliken charges with hydrogens summed into heavy atoms:
elementType: S N C C C C C C C C C C C
charge: 0.123861 0.344282 0.409086 0.408766 0.082266 -0.094741 -0.094697 -0.178262 -0.178251 -0.009037 0.001055 0.001053 -0.815381
polarizability: 2.31051659e+02 -7.17582323e-02 1.42480999e+02 -4.87720038e-01 4.19303321e-04 7.76672961e+01
1716.lowfreq: -12.7484 -5.9046 0.0016 0.0019 0.0023 5.0717 17.8348 46.5749 67.6016
frequency: 16.7770 46.5707 67.5930 72.2711 102.2819 150.7976 187.3722 206.5886 222.1196 276.6363 289.5272 326.7875 349.8958 401.8444 403.9699 432.5609 469.7027 541.0128 542.3448 565.5723 619.1488 722.4279 760.2905 779.3936 787.1977 806.4515 873.2127 902.4314 911.3198 966.9832 978.1402 1002.8995 1034.3339 1059.3036 1060.6323 1087.6982 1106.5884 1178.7252 1217.6316 1234.3054 1248.0252 1269.7276 1273.3705 1312.8974 1318.4224 1373.0654 1388.5222 1390.3030 1439.4871 1461.1075 1473.5435 1474.2654 1474.6808 1476.2364 1488.3326 1488.7795 1585.4369 1598.5288 2185.7286 2987.9391 2988.2380 2997.0178 2997.3874 3049.6555 3049.8808 3085.7737 3086.1003 3094.1212 3094.4739 3123.7355 3131.7924 3159.3496
redmass: 7.3160 4.4928 2.6866 2.2415 4.8879 3.4073 1.2539 1.1193 3.7105 2.3222 3.1646 3.5857 4.1956 6.9681 7.1043 5.2818 3.6468 4.8871 3.8543 3.8132 3.9725 6.1634 2.3469 1.2084 1.2012 1.6825 2.5752 6.7707 1.3564 2.4225 1.3407 2.4876 1.7525 1.9804 1.8425 1.6654 1.5630 1.1671 3.2261 1.3720 1.5118 1.4101 2.0336 1.4438 1.7155 5.0312 1.2002 1.1983 2.7922 2.5230 1.0617 1.0435 1.0434 1.0923 1.1156 1.0870 7.3410 6.0922 12.8700 1.0348 1.0348 1.0600 1.0601 1.1017 1.1016 1.1002 1.1002 1.1012 1.1012 1.0862 1.0920 1.0991
irintensity: 0.0786 0.3258 0.0892 0.1356 1.4453 0.0558 0.3233 0.1399 0.0377 0.6498 0.4313 1.4267 2.2492 0.1725 0.2392 3.9129 1.1899 0.0104 0.9393 7.5058 0.1369 21.9030 31.5651 20.0580 0.6316 31.3058 17.7901 29.3220 0.4844 0.1189 1.0459 0.7154 0.2897 0.9464 16.8470 5.7567 2.8813 1.9688 0.0052 0.0006 2.7443 0.1882 0.1597 1.2161 1.2801 1.5300 0.1024 21.3377 23.5346 6.2819 0.3952 5.8278 14.2333 8.4346 16.5723 12.4671 4.7372 1.9501 1082.1367 19.2019 46.8766 24.5586 29.3193 5.7948 9.1982 50.2078 29.1587 34.9461 39.5038 0.8144 21.2760 29.9331
temp: 298.150 k
press: 1.00000 atm
elementType: 16 7 6 6 6 6 6 6 6 6 6 6 6 1 1 1 1 1 1 1 1 1 1 1 1 1
symmnumber: 1
zpe: 552239.7 jmol-1
zpe.correction: 0.210337 hartree
zpe.thermalcorrener: 0.224074 hartree
zpe.thermalcorrenthalpy: 0.225018 hartree
zpe.thermalcorrgfe: 0.168016 hartree
zpe.sumelectzpe: -878.843114 hartree
zpe.sumelectthermal: -878.829377 hartree
zpe.sumelectthermalent: -878.828433 hartree
zpe.sumelectthermalfe: -878.885435 hartree
dipole: 3.4400 -0.0027 0.3024
dipole: 3.4533
quadrupole: -89.8784 -76.1163 -88.2693
quadrupole: 0.0165 -0.9078 -0.0004
quadrupole: -5.1238 8.6384 -3.5146 0.0165 -0.9078 -0.0004
hfenergy: -879.0534512 hartree
pointgroup: C01 [X(C11H13N1S1)]
dipole: -0.0000969 -1.3476651 0.1723114 debye
dipolederiv: -0.0794833 0.0001889 -0.0000303 0.000072 -1.2951811 0.2109442 -0.0000123 0.2380394 -0.1152439 -0.1726529 -0.0004236 0.0000205 -0.0000226 -2.2216766 0.3870771 -0.0000827 0.4313491 -0.0732478 0.220936 -0.073352 0.0632656 -0.153568 -0.1000922 -0.0203242 0.0616832 0.0109374 -0.0617051 0.2204905 0.0738914 -0.0630512 0.1538256 -0.1003178 -0.0203716 -0.0614619 0.0109215 -0.0618547 0.0275505 -0.0000407 -0.0000005 -0.0000289 1.0420978 -0.176541 0.000053 -0.199286 0.0747139 0.0791708 0.0871063 -0.0505137 0.0595046 0.0732822 0.0280717 -0.1557006 0.023032 0.0453514 0.0791953 -0.0871243 0.050533 -0.0592291 0.0730221 0.028012 0.1556394 0.0232046 0.045409 -0.0565439 0.0909939 -0.0270135 0.1694763 -0.0484163 -0.006084 -0.031979 -0.0246182 -0.1732729 -0.0562045 -0.0908401 0.0270505 -0.169562 -0.0484625 -0.0061744 0.0319678 -0.0245617 -0.1732627 0.041957 -0.0001773 0.0001387 -0.0000253 0.0123878 -0.0435596 0.0001333 -0.0386879 -0.1138084 -0.0032803 0.002819 -0.021649 0.0436436 0.0827435 0.0204565 0.0664091 0.0094644 0.0048035 -0.0030781 -0.0030547 0.0216593 -0.0438914 0.0827026 0.0203641 -0.0664175 0.0092918 0.0048385 -0.057315 -0.000023 0.000008 -0.0000826 2.7305899 -0.4867828 0.000018 -0.5581298 -0.013646 -0.0650304 -0.0542424 0.0666754 -0.109155 0.0015048 0.0986196 0.070199 0.0554091 -0.0033372 0.0418945 0.0002591 -0.0455176 0.0477498 -0.0776099 -0.0990542 -0.0165931 -0.0699128 0.0141353 0.0420325 -0.0000186 0.0458059 -0.0474202 -0.077815 -0.0988816 0.016896 -0.0697662 0.0143413 -0.0653002 0.0540561 -0.0670058 0.1087631 0.0019423 0.0986056 -0.0704766 0.0553151 -0.0035628 -0.0768763 -0.1064811 0.0295809 -0.0632666 0.0339762 0.0200528 0.0177283 0.0242891 0.1433796 -0.077112 0.1063495 -0.029746 0.0631068 0.034153 0.0200553 -0.0177948 0.024244 0.1433646 0.0779777 0.0001202 -0.0000786 0.0001182 -0.1200483 0.0699676 -0.0000956 0.0670348 0.1397519 -0.0079245 -0.0806618 0.096262 -0.0769849 0.0191225 0.0709639 0.0650579 0.046274 0.0166899 -0.1561208 0.0943926 -0.0551001 0.1396337 0.0455056 0.0274873 -0.0691848 0.0091647 0.052571 0.1048029 0.0057337 -0.0106812 -0.0434007 -0.103969 -0.1207057 -0.0078673 -0.0542593 0.0121839 0.1046749 -0.0052177 0.0110592 0.0439815 -0.1040378 -0.1205371 0.0081031 -0.054156 0.0123569 -0.1556492 -0.0947022 0.0548946 -0.1399837 0.045057 0.0274346 0.0690258 0.0091679 0.0526445 -0.0081112 0.0804487 -0.0965661 0.0767458 0.0195393 0.0709039 -0.0652479 0.046239 0.0164063 unknown
polarizability: 142.4809257|0.0138095|223.8760588|0.030035|-32.3941623|84.8429696 unknown
InChI: InChI=1S/C11H13NS/c1-3-9-6-5-7-10(4-2)11(9)12-8-13/h5-7H,3-4H2,1-2H3
charge 0 multiplicity 1
26 atoms
S  -0.000204 4.10126 -0.703166
N  -0.000267 1.314584 -0.156316
C  -1.251127 -0.723234 0.286181
C  1.251114 -0.721263 0.287066
C  -0.000445 -0.044336 0.134503
C  -2.570977 0.003633 0.088773
C  2.569818 0.008037 0.09022
C  -1.22082 -2.101375 0.599315
C  1.22268 -2.099372 0.600325
C  0.001411 -2.789896 0.756301
C  -2.947999 0.164644 -1.410987
C  2.948333 0.168376 -1.40924
C  0.000002 2.497207 -0.391372
H  -3.372072 -0.560772 0.600163
H  -2.531951 1.005084 0.55697
H  2.528303 1.00991 0.557414
H  3.371601 -0.554097 0.602957
H  -2.170617 -2.634335 0.724951
H  2.173235 -2.630865 0.726397
H  0.002175 -3.856421 1.005247
H  -2.191528 0.757992 -1.953521
H  -3.919734 0.680611 -1.511088
H  -3.026582 -0.821154 -1.902849
H  3.029596 -0.817683 -1.90013
H  3.919077 0.686311 -1.508714
H  2.191277 0.759652 -1.953199
