program: Gaussian 09
title: 000141187
version: EM64L-G09RevD.01
frameworkgroup: C1[X(C4H4)]
method: RPBEPBE
basis: SDD
operation: Freq
keyword: #p
keyword: freq=noraman
keyword: PBEPBE/SDD
title: #p freq=noraman PBEPBE/SDD
converged: YES YES YES YES
title: Mulliken charges:
elementType: C C C C H H H H
charge: -0.572204 -0.572204 0.095960 0.095959 0.238123 0.238122 0.238122 0.238123
chargesum: 0.00000
title: Mulliken charges with hydrogens summed into heavy atoms:
elementType: C C C C
charge: -0.095959 -0.095960 0.095960 0.095959
polarizability: 1.02328536e+02 -6.96196855e-06 2.45898420e+01 2.05202847e-04 -2.74921209e-09 1.88733747e+01
1716.lowfreq: -35.4487 -7.3856 -6.3336 -0.0007 -0.0003 0.0003 205.9982 223.8647 312.8408
frequency: 205.9982 223.8647 312.8408 551.7688 751.4085 868.5970 882.6510 885.3464 991.4633 1022.1478 1388.1474 1435.9841 1622.0805 2159.4948 3075.7384 3077.7453 3173.5975 3174.1050
redmass: 2.4916 3.8942 3.6200 7.4673 1.0078 3.9142 1.3183 1.3363 1.4454 1.4318 1.1164 1.1652 6.3221 10.9336 1.0571 1.0599 1.1141 1.1141
irintensity: 12.0533 8.8482 0.0000 0.0000 0.0000 0.0000 0.0000 175.1315 0.0000 2.3222 4.4940 0.0000 23.6232 0.0000 0.0000 6.2181 15.3377 0.0000
temp: 298.150 k
press: 1.00000 atm
elementType: 6 6 6 6 1 1 1 1
symmnumber: 1
zpe: 154336.1 jmol-1
zpe.correction: 0.058784 hartree
zpe.thermalcorrener: 0.063643 hartree
zpe.thermalcorrenthalpy: 0.064587 hartree
zpe.thermalcorrgfe: 0.032676 hartree
zpe.sumelectzpe: -154.442188 hartree
zpe.sumelectthermal: -154.437328 hartree
zpe.sumelectthermalent: -154.436384 hartree
zpe.sumelectthermalfe: -154.468295 hartree
dipole: 0.0000 0.0000 0.0003
dipole: 0.0003
quadrupole: -17.0285 -22.7058 -26.8939
quadrupole: 0.0000 -0.0002 0.0000
quadrupole: 5.1809 -0.4964 -4.6845 0.0000 -0.0002 0.0000
hfenergy: -154.5009712 hartree
pointgroup: C01 [X(C4H4)]
dipole: 0. -0.0000239 0.0001149 debye
dipolederiv: -0.2226906 -0.0000048 -0.0000367 0.0000347 0.1192531 0.1654297 -0.000133 0.1654324 -0.3360619 -0.2226893 -0.0000269 0.0000186 -0.0000535 0.1192672 0.1654137 0.0000793 0.1654111 -0.3360751 0.1905878 0.0000118 0.0000029 -0.0000054 -0.1249396 -0.0354278 0.0000225 -0.0354259 -0.0274379 0.1905858 0.0000151 0.0000098 0.0000268 -0.1249437 -0.0354205 0.0000019 -0.0354224 -0.0274333 0.0160463 0.0692735 0.0225294 0.0672893 0.0028573 -0.0650072 0.0219254 -0.0650193 0.1817415 0.0160572 -0.0692824 -0.0224976 -0.0673223 0.0028303 -0.0649969 -0.0218197 -0.0649873 0.1817574 0.0160434 0.0692867 0.0224965 0.0673224 0.0028372 -0.0649877 0.0218307 -0.0649786 0.1817619 0.0160595 -0.0692728 -0.0225229 -0.067292 0.0028383 -0.0650033 -0.021907 -0.06501 0.1817474 unknown
polarizability: 102.328536|0.0029482|24.0439008|0.0023023|1.6801203|19.4193161 unknown
InChI: InChI=1S/C4H4/c1-3-4-2/h1-2H2
charge 0 multiplicity 1
8 atoms
C  -1.986526 -0.000014 -0.000092
C  1.9865 0.000139 0.00002
C  -0.645076 0.000022 -0.000059
C  0.645049 0.000073 -0.000022
H  -2.559774 0.889883 0.289187
H  -2.559712 -0.889998 -0.289224
H  2.55977 -0.889808 -0.289062
H  2.559668 0.890102 0.289252
