program: Gaussian 09
title: 000141178
version: EM64L-G09RevD.01
frameworkgroup: C1[X(C6H3BrS2)]
method: RPBEPBE
basis: SDD
operation: Freq
keyword: #p
keyword: freq=noraman
keyword: PBEPBE/SDD
title: #p freq=noraman PBEPBE/SDD
converged: NO YES NO YES
title: Mulliken charges:
elementType: Br S S C C C C C C H H H
charge: 0.077214 0.388558 0.330166 0.722875 -0.893955 -0.148957 -0.244115 -0.514625 -0.511252 0.269938 0.257133 0.267021
chargesum: 0.00000
title: Mulliken charges with hydrogens summed into heavy atoms:
elementType: Br S S C C C C C C
charge: 0.077214 0.388558 0.330166 0.722875 -0.893955 0.120981 0.013018 -0.514625 -0.244231
polarizability: 1.77798316e+02 -4.26318772e+00 1.01370007e+02 -8.44369575e-03 -5.80304809e-03 3.76547294e+01
1716.lowfreq: -8.1055 -5.4345 -0.0025 -0.0020 -0.0014 2.5309 88.2474 156.3318 195.5632
frequency: 88.2473 156.3314 195.5631 241.4007 254.2788 325.2619 454.2338 470.5039 484.9779 558.1593 625.3847 637.5864 646.9874 722.9870 764.7860 838.7614 874.2456 882.7272 1016.4406 1039.3013 1101.8541 1165.3255 1253.2899 1404.6380 1415.0062 1516.7714 1527.3788 3180.4476 3193.6501 3240.0582
redmass: 12.8858 12.9001 6.7439 9.6261 21.9151 13.9920 5.7742 3.8429 11.4430 5.7129 11.5105 2.0594 8.8224 1.6187 6.1974 1.3943 6.6222 1.3866 2.7066 11.8480 1.2413 1.2831 1.5479 6.5411 10.4276 7.8074 6.3046 1.0924 1.0959 1.1001
irintensity: 0.7393 0.2307 1.8171 0.1641 1.1500 2.0641 19.7936 3.2631 1.4258 1.6612 1.2458 48.2592 3.5802 38.7284 42.4842 28.4758 46.8453 12.8067 7.1225 12.3305 9.4133 27.4855 1.3198 0.5793 20.1623 2.1452 18.3678 3.8132 1.0512 0.7833
temp: 298.150 k
press: 1.00000 atm
elementType: 35 16 16 6 6 6 6 6 6 1 1 1
symmnumber: 1
zpe: 181094.2 jmol-1
zpe.correction: 0.068975 hartree
zpe.thermalcorrener: 0.077009 hartree
zpe.thermalcorrenthalpy: 0.077953 hartree
zpe.thermalcorrgfe: 0.034382 hartree
zpe.sumelectzpe: -1039.353357 hartree
zpe.sumelectthermal: -1039.345323 hartree
zpe.sumelectthermalent: -1039.344379 hartree
zpe.sumelectthermalfe: -1039.387950 hartree
dipole: -1.2904 1.5598 0.0006
dipole: 2.0244
quadrupole: -67.7846 -69.6560 -80.2217
quadrupole: -2.8204 -0.0001 -0.0006
quadrupole: 4.7695 2.8980 -7.6676 -2.8204 -0.0001 -0.0006
hfenergy: -1039.4223322 hartree
pointgroup: C01 [X(C6H3Br1S2)]
dipole: -0.5560176 0.5702349 0.0002252 debye
dipolederiv: -0.6733574 -0.0617153 0.0001427 -0.0939713 -0.0383934 0.0000181 -0.0000167 0.000005 0.056913 -0.272519 -0.0549887 0.0000478 0.0246152 -0.1255271 0.000059 -0.0000427 0.0001345 0.2207921 -0.1657443 0.0243187 -0.0000015 -0.0173389 -0.1869751 0.0000579 0.0000676 0.0001275 0.1880737 -0.0573367 -0.0243158 0.0000271 0.0118514 -0.3176799 0.0000567 -0.0000141 0.0000416 0.0561718 0.4146242 -0.0345966 0.0000374 -0.0313233 0.0738313 -0.0000636 -0.0000105 -0.0000602 -0.3091409 -0.171856 0.1672032 0.0000115 -0.025511 -0.1713798 0.000042 0.0000735 -0.0000789 -0.0799251 0.1036166 -0.1902186 0.0000482 -0.1107869 -0.1019792 0.0000464 0. -0.0000245 -0.1267175 0.977358 0.1906612 -0.0003556 0.2679004 0.4207499 -0.0001291 0.000054 -0.0000695 -0.2933463 -0.3471214 -0.0121424 0.0000773 -0.0637829 0.4326618 -0.0001302 -0.0001093 -0.0001112 -0.3365238 0.0885783 -0.0093082 0.0000125 -0.066858 -0.0046206 0.0000084 -0.000045 0.000019 0.1984711 0.0946587 -0.0175209 -0.0000184 0.0550607 -0.0447748 0.000009 0.0000226 -0.0000022 0.1968162 0.0090992 0.0226233 -0.0000291 0.0501446 0.0640867 0.0000253 0.0000205 0.0000188 0.2284156 unknown
polarizability: 177.9831846|2.0028408|101.1851384|-0.0079426|-0.006472|37.6547294 unknown
InChI: InChI=1S/C6H3BrS2/c7-5-3-4-1-2-8-6(4)9-5/h1-3H
charge 0 multiplicity 1
12 atoms
Br 3.785197 0.158228 -0.000582
S  1.067484 -1.591911 0.000303
S  -2.199285 -1.342458 0.0002
C  -0.408847 0.647498 0.000034
C  -0.513747 -0.754879 0.000083
C  0.966761 1.101972 0.000112
C  -1.707294 1.288729 -0.000024
C  1.864785 0.054869 -0.000222
C  -2.754466 0.388359 -0.000271
H  1.270759 2.150111 0.000117
H  -1.854282 2.371223 -0.000021
H  -3.826265 0.578158 -0.000429
