program: Gaussian 09
title: 000141176
version: EM64L-G09RevD.01
frameworkgroup: C1[X(C9H9NO)]
method: RPBEPBE
basis: SDD
operation: Freq
keyword: #pfreq=noraman
keyword: PBEPBE/SDD
title: #p freq=noraman PBEPBE/SDD
converged: NO YES NO NO
title: Mulliken charges:
elementType: O N C C C C C C C C C H H H H H H H H H
charge: -0.257781 -0.029634 0.353864 -0.249664 -0.349941 -0.334757 -0.344261 -0.369643 0.388618 -0.681324 -0.259467 0.214280 0.214133 0.259299 0.253218 0.258015 0.254145 0.211558 0.234710 0.234633
chargesum: 0.00000
title: Mulliken charges with hydrogens summed into heavy atoms:
elementType: O N C C C C C C C C C
charge: -0.257781 -0.029634 0.353864 0.178750 -0.090642 -0.081539 -0.086246 -0.115498 0.388618 -0.000423 -0.259467
polarizability: 1.83668899e+02 -1.39223552e+00 9.42948801e+01 6.26763476e-02 8.96391509e-03 5.15336272e+01
1716.lowfreq: -6.3397 -0.0007 -0.0003 0.0002 6.0948 7.0316 49.8776 111.6874 113.4490
frequency: 49.8769 111.6871 113.4473 123.6496 180.9345 244.8902 265.8559 297.9609 392.4513 410.6673 468.0168 493.8961 546.9847 556.3720 638.3870 692.1185 731.7099 794.5794 812.2032 833.7052 846.2549 899.4486 954.9838 972.6179 1001.4091 1031.8970 1114.7346 1121.6173 1134.6046 1180.3481 1204.2088 1237.8719 1263.4155 1304.6846 1356.4991 1369.0001 1401.8018 1429.7128 1461.9778 1475.3261 1485.7552 1498.8673 1564.6452 1620.0636 2175.3239 2964.2190 2999.3739 3025.6302 3097.3162 3108.4452 3152.2267 3155.4535 3175.3504 3178.7025
redmass: 4.2987 5.4735 2.5466 3.1135 4.5387 1.2829 4.7864 4.2899 4.2685 2.9753 5.1062 6.4524 6.9590 3.0322 7.0737 5.3283 3.7461 5.0693 1.2161 1.1534 1.5967 3.5638 1.3696 1.3504 2.7597 2.6984 1.9273 1.4601 1.4370 1.3066 2.9597 3.5582 1.1412 1.2846 2.8894 1.6043 1.2640 4.1415 1.0396 1.1214 1.1627 1.9674 7.1165 6.2534 12.6276 1.0554 1.0364 1.1079 1.0990 1.1016 1.0890 1.0887 1.0960 1.0974
irintensity: 0.1481 2.1611 0.0699 8.3183 2.8856 0.5798 0.4672 1.4664 0.0018 0.0593 1.4452 4.4627 0.3475 21.8036 0.4006 17.0424 0.0959 0.2613 23.4053 2.1877 73.0178 43.0119 1.0726 0.0000 4.4836 70.8716 0.8554 15.8287 4.8631 111.1431 6.8633 255.9314 0.0025 0.6093 0.8514 16.3908 35.1844 5.0602 12.7165 45.0935 36.3704 63.1220 13.0788 144.1662 75.6277 34.7983 22.4135 31.2244 26.2441 33.1581 5.3892 3.5031 10.5419 2.2140
temp: 298.150 k
press: 1.00000 atm
elementType: 8 7 6 6 6 6 6 6 6 6 6 1 1 1 1 1 1 1 1 1
symmnumber: 1
zpe: 411055.9 jmol-1
zpe.correction: 0.156563 hartree
zpe.thermalcorrener: 0.166841 hartree
zpe.thermalcorrenthalpy: 0.167785 hartree
zpe.thermalcorrgfe: 0.120395 hartree
zpe.sumelectzpe: -477.520376 hartree
zpe.sumelectthermal: -477.510098 hartree
zpe.sumelectthermalent: -477.509154 hartree
zpe.sumelectthermalfe: -477.556544 hartree
dipole: -6.2522 -0.9634 -0.0024
dipole: 6.3260
quadrupole: -82.9698 -57.3273 -66.9038
quadrupole: 6.9181 -0.0240 0.0064
quadrupole: -13.9028 11.7397 2.1632 6.9181 -0.0240 0.0064
hfenergy: -477.6769392 hartree
pointgroup: C01 [X(C9H9N1O1)]
dipole: 2.4505406 -0.4095643 0.146524 debye
dipolederiv: -2.1483246 0.1818067 -0.1165107 0.1352282 -0.3299229 0.0066286 -0.1184283 0.009645 -0.2882183 -0.6438207 -0.0182469 -0.0266109 -0.0375879 -0.2363142 -0.0015654 -0.0280178 -0.0002901 -0.259045 1.8036064 -0.036078 0.1114481 0.3119442 0.1127929 0.020523 0.127258 -0.0025541 0.12577 0.9703203 -0.1830305 0.0301411 -0.6279653 0.400006 -0.0417902 0.0099887 -0.0117412 0.391506 -0.5387469 0.0481681 -0.0223584 0.318987 0.0243087 0.0303873 -0.010144 0.0120859 -0.1720072 -0.476744 -0.022776 -0.0193326 -0.4564201 -0.0681951 -0.0247386 -0.0390802 0.0043896 -0.2040861 0.2842137 0.0232177 0.0291321 0.1713783 0.1388866 0.0238706 0.0358278 0.0139305 -0.1294555 0.3199512 -0.0571913 0.0274166 -0.1039194 0.1208156 0.0040823 0.0254175 0.0073305 -0.1222367 -0.3917918 0.0114762 -0.0312632 -0.0409019 -0.0192667 -0.0072313 -0.0336199 -0.0037258 0.077067 -0.1530912 -0.0308606 -0.0144563 0.0110688 0.0511062 0.0014289 -0.0119018 -0.0016368 0.0516794 0.7483403 0.0460796 0.0508084 0.0700611 -0.0716014 0.0003649 0.0521233 -0.0012624 0.0278596 -0.0418547 -0.050473 0.0671233 0.1009857 -0.0578151 0.0980897 0.0292803 0.11151 -0.0670696 -0.0302573 -0.03011 -0.0651359 0.114082 -0.0398873 -0.0807237 -0.0137776 -0.1135902 -0.0962479 0.0600584 -0.0660043 -0.0105201 -0.0626383 -0.0088306 -0.0123876 -0.0102668 -0.012582 0.1702282 0.0158228 0.0884973 -0.0064138 0.1051197 -0.0034576 -0.0006492 -0.0056596 -0.0018361 0.1680814 0.0363083 0.0828177 -0.0047067 0.0668451 -0.0016842 -0.0029087 -0.0054586 -0.0018553 0.1615785 0.0583945 -0.0620542 -0.0097304 -0.0590102 -0.0273306 -0.0125047 -0.0096184 -0.0127257 0.1595787 -0.0627061 0.0972164 -0.0068908 0.1385024 -0.0480096 0.0005701 -0.0049635 -0.002013 0.1170444 0.0927646 -0.01796 0.0148393 -0.0861683 0.0221759 0.1026568 0.0450642 0.108019 -0.0429228 0.0975566 -0.0044951 0.0030208 -0.0695911 0.0422234 -0.1041027 -0.0340235 -0.1010977 -0.0691042 unknown
polarizability: 183.0895285|0.1357782|94.1870876|8.8836741|1.9388501|52.2207905 unknown
InChI: InChI=1S/C9H9NO/c1-2-11-9-5-3-8(7-10)4-6-9/h3-6H,2H2,1H3
charge 0 multiplicity 1
20 atoms
O  2.306785 0.499004 0.208155
N  -4.494206 -0.253195 -0.28644
C  0.938147 0.255032 0.105346
C  3.229047 -0.661215 0.216329
C  0.112697 1.411313 0.10204
C  0.353888 -1.03598 0.007854
C  -1.279403 1.281457 0.00217
C  -1.045514 -1.160014 -0.092549
C  -1.878177 -0.009481 -0.096781
C  4.64168 -0.097633 0.331863
C  -3.305728 -0.14317 -0.199744
H  2.982379 -1.315644 1.076649
H  3.097506 -1.236543 -0.722153
H  0.587474 2.3937 0.178512
H  0.9697 -1.939241 0.008903
H  -1.914227 2.172784 -0.000263
H  -1.499243 -2.153265 -0.168331
H  5.377988 -0.921447 0.337528
H  4.867319 0.567235 -0.519003
H  4.756688 0.480605 1.264216
