program: Gaussian 09
title: 000141172
version: EM64L-G09RevD.01
frameworkgroup: C1[X(P4S9)]
method: RPBEPBE
basis: SDD
operation: Freq
keyword: #p
keyword: freq=noraman
keyword: PBEPBE/SDD
title: #p freq=noraman PBEPBE/SDD
converged: YES YES NO NO
title: Mulliken charges:
elementType: S S S S S S S S S P P P P
charge: -0.017505 -0.017429 -0.017435 -0.077504 -0.077675 -0.077627 -0.041703 -0.041821 -0.041858 0.062398 0.062616 0.062644 0.222897
chargesum: 0.00000
title: Mulliken charges with hydrogens summed into heavy atoms:
polarizability: 3.53141651e+02 1.06246322e-02 3.53036981e+02 4.44943200e-03 -3.09935546e-03 2.46599336e+02
1716.lowfreq: -2.7562 -0.0025 -0.0022 -0.0011 1.9012 6.2567 76.8452 77.4333 77.9083
frequency: 76.8448 77.4325 77.9073 82.9766 83.8224 87.2834 109.6163 110.0725 123.0985 123.5093 130.0895 134.8354 138.8364 139.1739 198.2613 199.7170 199.9754 234.4465 239.3003 240.3866 250.9887 268.7602 269.2013 302.6707 314.1874 356.5965 357.1148 396.0209 399.0437 399.3168 564.2817 564.3166 579.4358
redmass: 31.9700 31.9667 31.9675 31.9382 31.9365 31.9493 31.6714 31.6701 31.6330 31.6325 31.5120 31.6908 31.7274 31.7306 31.6790 31.7503 31.7526 31.6302 31.9214 31.9199 31.5728 31.4961 31.4980 31.8222 31.5861 31.3158 31.3169 31.3234 31.2984 31.2979 31.4221 31.4222 31.3555
irintensity: 0.0026 0.0343 0.0353 0.1773 0.1722 0.2886 0.1553 0.1466 0.0075 0.0177 0.0009 0.9235 2.3414 2.2920 1.9282 2.7867 2.8777 3.5264 8.6310 8.4126 0.0129 0.3341 0.2715 5.9426 0.0151 41.7740 41.6781 63.3902 21.8174 21.7588 41.5287 41.5239 9.3818
temp: 298.150 k
press: 1.00000 atm
elementType: 16 16 16 16 16 16 16 16 16 15 15 15 15
symmnumber: 1
zpe: 46830.9 jmol-1
zpe.correction: 0.017837 hartree
zpe.thermalcorrener: 0.038382 hartree
zpe.thermalcorrenthalpy: 0.039327 hartree
zpe.thermalcorrgfe: -0.033105 hartree
zpe.sumelectzpe: -4946.550404 hartree
zpe.sumelectthermal: -4946.529858 hartree
zpe.sumelectthermalent: -4946.528914 hartree
zpe.sumelectthermalfe: -4946.601346 hartree
dipole: -0.0026 -0.0005 1.4143
dipole: 1.4143
quadrupole: -184.2188 -184.2233 -177.3807
quadrupole: -0.0039 -0.0034 -0.0008
quadrupole: -2.2779 -2.2824 4.5602 -0.0039 -0.0034 -0.0008
hfenergy: -4946.5682407 hartree
pointgroup: C01 [X(P4S9)]
dipole: 0.0010098 -0.000118 0.5564293 debye
dipolederiv: -0.4029519 0.0445342 0.009248 0.0442672 -0.3151582 0.0226456 0.0063091 0.0161791 -0.2241248 -0.3748615 -0.0601153 0.0149255 -0.0601122 -0.3426694 -0.0196596 0.0100704 -0.013836 -0.2241628 -0.299037 0.0160135 -0.0244623 0.0161272 -0.4184353 -0.0030832 -0.0170669 -0.002234 -0.2241931 -0.2682693 0.0001433 0.2127921 -0.0001041 -0.2675453 0.0278019 0.1039621 0.0134356 -0.414926 -0.2679719 0.0002464 -0.1302249 0.0005657 -0.2680609 0.1700076 -0.0637639 0.0833163 -0.4150181 -0.2677379 -0.0001805 -0.0820915 -0.0000723 -0.2683408 -0.1981869 -0.0400747 -0.0969255 -0.4148861 -0.6143244 -0.0537657 0.0965717 -0.0535798 -0.2109889 0.0125945 0.1407258 0.0185404 -0.1723986 -0.3584463 0.2020346 -0.0594876 0.2019732 -0.4674989 0.0775201 -0.0861895 0.1125878 -0.1724314 -0.2652363 -0.1479525 -0.0375225 -0.1480434 -0.5606052 -0.0902151 -0.0546237 -0.1313202 -0.1725625 0.8794481 0.0023837 -0.0412133 0.002821 0.8588898 -0.0051863 -0.0354541 -0.0046311 0.7751255 0.8668487 -0.0113635 0.0257244 -0.0112799 0.8723397 -0.0331027 0.0222068 -0.0292364 0.7754059 0.8615782 0.0081007 0.0161111 0.00769 0.8770719 0.038819 0.0141907 0.0340646 0.7752192 0.5109614 -0.0000788 -0.0003709 -0.0002525 0.5110016 0.0000451 -0.0002921 0.0000592 0.1089528 unknown
polarizability: 353.1422726|-0.0068899|353.0363514|0.0037492|0.0300951|246.5993442 unknown
InChI: InChI=1S/3PS.P.6S/c3*1-2;;;;;;;
charge 0 multiplicity 1
13 atoms
S  0.834357 2.008553 -1.191574
S  1.324196 -1.727393 -1.190865
S  -2.157126 -0.282416 -1.190755
S  2.13019 0.278898 1.877742
S  -1.305916 1.705855 1.877093
S  -0.823836 -1.983858 1.876927
S  4.101975 0.536981 -1.153984
S  -2.517185 3.283845 -1.153165
S  -1.587242 -3.820463 -1.154001
P  2.190252 0.286392 -0.436707
P  -1.343278 1.753646 -0.437373
P  -0.846285 -2.039992 -0.437723
P  -0.000203 -0.00015 2.714586
