program: Gaussian 09
title: 000141145
version: EM64L-G09RevD.01
frameworkgroup: C1[X(C6H14O3)]
method: RPBEPBE
basis: SDD
operation: Freq
keyword: #pfreq=noraman
keyword: PBEPBE/SDD
title: #p freq=noraman PBEPBE/SDD
converged: YES YES NO NO
title: Mulliken charges:
elementType: O O O C C C C C C H H H H H H H H H H H H H H
charge: -0.294215 -0.294001 -0.289226 0.394798 -0.426278 -0.681767 -0.518438 -0.514449 -0.530421 0.226756 0.210148 0.204749 0.224914 0.243260 0.203430 0.225435 0.249613 0.231178 0.243094 0.217595 0.212599 0.227679 0.233549
chargesum: 0.00000
title: Mulliken charges with hydrogens summed into heavy atoms:
elementType: O O O C C C C C C
charge: -0.294215 -0.294001 -0.289226 0.394798 0.010626 -0.008844 0.160039 0.177418 0.143406
polarizability: 8.02109490e+01 2.12296443e+00 7.36755621e+01 6.66623770e-01 4.67128690e-02 7.57035583e+01
1716.lowfreq: -19.6166 -9.9030 -0.0009 -0.0008 0.0005 22.1924 75.2768 100.2383 102.5625
frequency: 74.7688 100.1852 102.4459 107.3848 135.1345 166.7914 174.4703 195.3614 206.9399 253.6792 277.9873 297.7318 377.9301 395.6320 499.5410 519.1068 595.1893 668.8731 769.3006 886.9793 908.1835 965.7403 988.7499 1011.1011 1016.6791 1088.8845 1111.0994 1116.3002 1118.3013 1130.9614 1140.8530 1155.5187 1171.9177 1204.6583 1279.6246 1337.9689 1389.8450 1416.4027 1426.0811 1429.7644 1451.2854 1452.1462 1465.9146 1466.7371 1472.6685 1479.2633 1481.1059 1485.2905 1493.1929 2959.2875 2962.0680 2989.7112 2992.7028 3006.4157 3048.6777 3060.0676 3068.3729 3087.0307 3092.3356 3102.6037 3104.6691 3117.7686 3120.1959
redmass: 2.2373 1.9748 1.3767 1.7275 1.7757 1.8571 1.4983 1.2406 1.3784 3.3454 2.6795 2.8272 3.2669 4.8861 5.1052 4.5690 3.8089 4.3978 1.4229 3.8768 2.2835 2.8780 7.2249 4.5119 4.9328 2.3745 1.2780 1.2853 1.2821 1.5119 1.5504 1.4458 1.7885 3.3588 1.2147 1.5366 1.2031 1.1298 1.1392 1.1388 1.0563 1.0665 1.0580 1.0409 1.0642 1.0516 1.0524 1.0509 1.0544 1.0325 1.0370 1.0294 1.0359 1.0603 1.1018 1.0997 1.0946 1.0994 1.1031 1.1009 1.1005 1.1039 1.1048
irintensity: 4.9507 3.8224 0.7528 3.1807 6.4264 1.7761 8.5001 2.0646 1.6810 8.0584 3.7590 0.4964 7.3485 14.9566 8.3085 4.7419 3.5679 0.5679 2.0387 156.8055 36.7124 34.5586 141.9381 193.0294 43.5445 33.1717 1.0453 3.3127 0.4370 32.4517 45.9983 1.5278 32.7335 61.0043 26.6955 18.1639 17.7447 8.7039 9.7071 5.4505 5.2816 4.8679 9.5278 7.4434 1.4473 21.0009 16.5457 10.5142 9.4072 70.6043 56.5165 56.1484 33.8387 19.4452 50.2397 10.6870 44.2620 35.4956 34.7846 24.2673 35.2310 21.6769 27.3362
temp: 298.150 k
press: 1.00000 atm
elementType: 8 8 8 6 6 6 6 6 6 1 1 1 1 1 1 1 1 1 1 1 1 1 1
symmnumber: 1
zpe: 515432.5 jmol-1
zpe.correction: 0.196318 hartree
zpe.thermalcorrener: 0.208486 hartree
zpe.thermalcorrenthalpy: 0.209430 hartree
zpe.thermalcorrgfe: 0.158905 hartree
zpe.sumelectzpe: -461.893691 hartree
zpe.sumelectthermal: -461.881523 hartree
zpe.sumelectthermalent: -461.880579 hartree
zpe.sumelectthermalfe: -461.931104 hartree
dipole: -0.3025 0.1967 -1.4177
dipole: 1.4629
quadrupole: -51.3349 -55.8822 -53.2513
quadrupole: 2.7361 -1.5595 1.4512
quadrupole: 2.1546 -2.3927 0.2382 2.7361 -1.5595 1.4512
hfenergy: -462.090009 hartree
pointgroup: C01 [X(C6H14O3)]
dipole: -0.0933246 -0.24012 0.5146674 debye
dipolederiv: -0.8429029 0.2659809 0.0780327 0.3363367 -0.888582 -0.0801175 0.1924586 -0.234134 -0.5410318 -0.7859171 0.164385 -0.3396269 0.0807165 -0.5981162 0.2396684 -0.2495393 0.1420353 -0.8885883 -0.9360388 -0.1162436 0.3980774 -0.1474413 -0.5700075 0.2670374 0.2473812 0.0621245 -0.8249463 1.4611393 -0.1353515 -0.0741725 -0.031216 1.1550162 -0.5495681 -0.2270761 0.1529176 1.1817366 -0.1003326 -0.0679017 -0.0422226 -0.0968647 -0.0259906 -0.0098406 -0.0220428 -0.075284 -0.0954331 0.0052567 -0.0412298 0.0409463 -0.0313589 0.0249365 0.053694 -0.0037437 0.0146487 0.0503304 0.4376645 -0.1412109 -0.0028513 -0.2052452 0.5450286 0.0668177 0.1117013 -0.064265 0.2132325 0.4019526 -0.0568341 0.164283 0.0436288 0.2031779 0.0711405 0.1652372 -0.0613177 0.5325772 0.4342021 0.0282778 -0.1694648 -0.111876 0.1834235 0.116281 -0.1550012 -0.034658 0.529329 -0.0074535 0.0455685 0.1040727 0.0611913 0.0240146 -0.0763661 0.1027925 -0.0635062 -0.0099166 0.0156724 0.0315641 -0.0771606 0.0418895 -0.0628313 0.1138192 -0.0449664 0.1032533 0.0077907 -0.0376276 -0.1054648 -0.0975772 -0.1005164 0.0252622 -0.0662782 -0.1253215 -0.0949205 -0.050863 0.0035623 0.0561401 0.0874993 0.0953225 0.0291821 -0.0735247 0.1155719 -0.0480289 0.0051316 0.0678821 0.0970047 -0.0368698 0.0482454 -0.0240087 0.0875279 -0.0195743 0.1026847 0.0389345 -0.1103682 0.0057398 -0.117106 -0.0350608 0.0039825 -0.0485225 -0.1838314 0.0139351 -0.0281597 0.0391748 0.0792524 0.0702622 0.0718027 0.0289173 -0.0601205 0.0969061 -0.1063521 -0.0684222 0.0207145 -0.1010702 0.0346202 -0.0327262 -0.0562589 0.055523 0.0041568 0.1208901 0.0679011 -0.0095677 -0.0883069 -0.0151159 -0.1555611 -0.0443912 -0.0260979 0.0162978 0.0534258 0.0359804 0.0061151 0.0126602 0.1111734 -0.0117054 0.1013331 -0.0709037 0.03095 -0.0205054 -0.1160633 -0.0134127 0.1147496 -0.0803261 0.1371227 -0.0459142 0.0563469 -0.0496158 0.0161879 0.0532369 -0.013192 -0.0104568 -0.1075159 0.0269037 0.0747851 -0.0909193 -0.0293687 -0.0420264 -0.1930225 -0.0510626 -0.1134057 0.0725295 -0.1413376 -0.0200125 0.0386177 0.045426 0.0015486 0.0629495 0.0145395 0.0761529 -0.0014869 0.1577495 -0.0629466 -0.0142145 -0.0187981 0.0613468 0.0373164 unknown
polarizability: 80.5214922|-1.1502595|73.4907704|-1.1806027|-0.6236438|75.5778068 unknown
InChI: InChI=1S/C6H14O3/c1-5-6(7-2,8-3)9-4/h5H2,1-4H3
charge 0 multiplicity 1
23 atoms
O  0.732648 -0.663904 -0.954091
O  -0.759981 1.075695 -0.593936
O  -0.894208 -0.96658 0.668202
C  -0.003783 0.050808 0.064309
C  0.891301 0.745543 1.109406
C  1.944048 1.674048 0.472109
C  1.46473 -1.856779 -0.505486
C  -1.551999 0.617671 -1.754524
C  -1.815315 -0.456124 1.691921
H  0.241545 1.326884 1.788058
H  1.378411 -0.040174 1.71758
H  2.580261 2.132592 1.250925
H  2.592717 1.116442 -0.225913
H  1.451216 2.478518 -0.099256
H  2.281073 -1.590944 0.195862
H  1.898632 -2.288265 -1.420967
H  0.781163 -2.577469 -0.025938
H  -2.128412 -0.290037 -1.500008
H  -0.889808 0.405196 -2.609903
H  -2.228936 1.45511 -1.984864
H  -1.29772 -0.269634 2.653654
H  -2.568235 -1.247897 1.833752
H  -2.308249 0.474098 1.351207
