program: Gaussian 09
title: 000141139
version: EM64L-G09RevD.01
frameworkgroup: C1[X(CHF4N)]
method: RPBEPBE
basis: SDD
operation: Freq
keyword: #pfreq=noraman
keyword: PBEPBE/SDD
title: #p freq=noraman PBEPBE/SDD
converged: NO NO NO NO
title: Mulliken charges:
elementType: F F F F N C H
charge: -0.151910 -0.151953 -0.158886 -0.158909 0.164741 0.198489 0.258429
chargesum: 0.00000
title: Mulliken charges with hydrogens summed into heavy atoms:
elementType: F F F F N C
charge: -0.151910 -0.151953 -0.158886 -0.158909 0.164741 0.456918
polarizability: 2.66834312e+01 4.24917056e-04 2.98272105e+01 9.46872071e-01 -1.27907021e-03 1.68158425e+01
1716.lowfreq: -0.0005 -0.0003 0.0006 5.5072 11.3174 21.9370 85.5698 202.1353 314.9565
frequency: 85.5611 202.1336 314.9563 390.3584 426.3281 441.9770 544.6986 801.8063 883.0173 938.6344 1027.7529 1034.9026 1251.5133 1281.3603 3101.0743
redmass: 13.5297 18.4701 17.4581 6.4469 13.7452 16.6796 13.4501 14.3469 13.6904 8.3816 7.0512 6.8885 1.2392 1.1721 1.0897
irintensity: 0.7328 3.1705 0.7002 29.1690 2.0176 5.0677 8.2569 77.3823 51.1928 22.1794 99.5455 208.3890 21.5946 11.8045 11.2915
temp: 298.150 k
press: 1.00000 atm
elementType: 9 9 9 9 7 6 1
symmnumber: 1
zpe: 76118.8 jmol-1
zpe.correction: 0.028992 hartree
zpe.thermalcorrener: 0.034887 hartree
zpe.thermalcorrenthalpy: 0.035831 hartree
zpe.thermalcorrgfe: -0.001114 hartree
zpe.sumelectzpe: -492.211078 hartree
zpe.sumelectthermal: -492.205183 hartree
zpe.sumelectthermalent: -492.204239 hartree
zpe.sumelectthermalfe: -492.241184 hartree
dipole: -0.4969 0.0001 1.8461
dipole: 1.9118
quadrupole: -35.1014 -34.8875 -29.6232
quadrupole: 0.0002 -0.8784 -0.0009
quadrupole: -1.8974 -1.6834 3.5808 0.0002 -0.8784 -0.0009
hfenergy: -492.2400698 hartree
pointgroup: C01 [X(C1H1F4N1)]
dipole: 0.2127102 0.0003543 0.7214409 debye
dipolederiv: -0.4456428 0.2289111 0.0419973 0.2023054 -0.6018573 -0.0483892 0.0593087 -0.1265679 -0.2726396 -0.4454171 -0.2287666 0.0423092 -0.2020566 -0.6018291 0.0488875 0.0594646 0.1270209 -0.2729035 -0.3144205 -0.2462627 0.0262534 -0.1864916 -0.5657132 0.049431 0.1606122 0.3073501 -0.2391217 -0.3146765 0.246376 0.0261337 0.1866449 -0.5655995 -0.0492376 0.1606742 -0.30706 -0.2389728 0.2837584 -0.0001097 -0.0054677 -0.0001756 0.9646866 -0.0001522 -0.3164286 -0.0002836 0.3937312 1.2576557 -0.0001485 -0.1285366 -0.000217 1.3423973 -0.000483 -0.1304712 -0.0004281 0.6766825 -0.0212571 0.0000004 -0.0026893 -0.0000093 0.0279152 -0.0000563 0.0068401 -0.0000314 -0.0467761 unknown
polarizability: 26.6327972|-0.0010756|29.8272086|-1.1805244|-0.0050656|16.8664783 unknown
InChI: InChI=1S/CHF4N/c2-1(3)6(4)5/h1H
charge 0 multiplicity 1
7 atoms
F  1.376577 -1.141929 -0.084853
F  1.375952 1.14324 -0.086482
F  -1.346922 -1.15924 0.153359
F  -1.347633 1.159152 0.152834
N  -0.648938 -0.000006 -0.472744
C  0.673904 0.000722 0.332102
H  0.520459 0.001461 1.424283
