program: Gaussian 09
title: 000141136
version: EM64L-G09RevD.01
frameworkgroup: C1[X(C14H8S4)]
method: RPBEPBE
basis: SDD
operation: Freq
keyword: #pfreq=noraman
keyword: PBEPBE/SDD
title: #p freq=noraman PBEPBE/SDD
converged: NO YES NO NO
title: Mulliken charges:
elementType: S S S S C C C C C C C C C C C C C C H H H H H H H H
charge: 0.273030 0.273019 0.273030 0.273021 -0.337578 -0.337579 -0.085768 -0.085763 -0.085765 -0.085766 -0.274635 -0.274633 -0.274636 -0.274632 -0.226712 -0.226713 -0.226711 -0.226713 0.248043 0.248043 0.248044 0.248043 0.234833 0.234833 0.234832 0.234833
chargesum: 0.00000
title: Mulliken charges with hydrogens summed into heavy atoms:
elementType: S S S S C C C C C C C C C C C C C C
charge: 0.273030 0.273019 0.273030 0.273021 -0.337578 -0.337579 -0.085768 -0.085763 -0.085765 -0.085766 -0.026592 -0.026590 -0.026592 -0.026590 0.008121 0.008120 0.008121 0.008120
polarizability: 4.27288346e+02 -4.72162078e-05 2.03859073e+02 5.97458800e-04 -2.50956134e-04 7.40886178e+01
1716.lowfreq: -10.0682 -0.0026 0.0016 0.0018 1.2443 2.9074 6.4599 33.5129 59.4323
frequency: -10.0682 33.4285 59.4323 65.3557 133.7058 135.5363 181.6425 203.0034 214.3924 216.4192 234.8203 310.0990 369.6482 407.6732 423.3060 423.7736 449.3488 451.2018 451.4623 458.2695 459.3223 483.5820 501.6999 502.2497 654.9698 656.0214 696.6671 696.9833 701.7072 703.7509 714.9726 748.9034 749.0727 801.0035 853.8995 854.0577 920.9312 935.0525 935.2193 977.5686 977.5832 1008.7119 1018.2532 1025.9607 1026.0165 1112.7702 1114.4235 1125.8614 1126.3264 1175.8131 1175.9667 1262.7253 1262.9493 1373.3948 1373.8851 1420.6788 1420.8813 1440.6349 1441.7510 1571.2653 1576.0678 1577.2413 1577.2547 1609.8961 3137.3712 3137.3724 3145.7667 3145.7853 3157.3747 3157.3870 3173.1833 3173.2949
redmass: 7.8594 14.5895 7.5747 7.7684 6.0618 5.4364 9.9608 6.6517 7.9368 5.7055 9.5561 7.9449 14.9964 13.9678 3.0381 3.0431 8.6754 15.3622 30.4077 12.4289 8.9678 12.0521 4.2937 4.2923 6.7162 6.6600 4.4570 4.4523 7.5127 7.4888 13.1629 1.2118 1.2106 13.6274 1.3218 1.3228 11.2048 1.3772 1.3776 1.3192 1.3190 7.8349 8.2304 2.7445 2.7389 2.7958 2.7752 1.5613 1.5583 1.0679 1.0690 1.4082 1.4096 9.7208 9.5476 2.0859 2.0871 2.3209 2.3272 7.1619 6.2374 6.2614 6.7561 10.8630 1.0854 1.0854 1.0899 1.0899 1.0951 1.0951 1.1010 1.1010
irintensity: 0.8484 0.0000 0.3845 0.0000 0.0000 0.0000 0.0000 7.1354 0.0000 0.0000 0.3739 1.3140 0.0000 13.6158 17.5638 0.0000 0.0000 0.4125 0.0001 0.0000 1.1655 0.0001 0.0000 0.0000 46.0976 0.0000 0.0000 0.0000 0.0000 4.0080 71.1282 0.0016 202.6021 4.6502 0.0000 0.0000 0.0000 3.8917 0.0000 0.0000 0.0000 5.2628 0.0000 44.1618 0.0058 100.4895 0.0001 0.0000 5.6084 4.8959 0.0001 9.8181 0.0000 0.0000 17.3207 0.0002 25.8648 140.6696 0.0002 0.0000 0.0000 5.2227 8.9651 0.0000 0.0209 0.0089 7.6761 0.0009 0.0129 25.7100 53.2869 0.0016
temp: 298.150 k
press: 1.00000 atm
elementType: 16 16 16 16 6 6 6 6 6 6 6 6 6 6 6 6 6 6 1 1 1 1 1 1 1 1
symmnumber: 1
zpe: 453348.8 jmol-1
zpe.correction: 0.172671 hartree
zpe.thermalcorrener: 0.187464 hartree
zpe.thermalcorrenthalpy: 0.188408 hartree
zpe.thermalcorrgfe: 0.129771 hartree
zpe.sumelectzpe: -2129.283158 hartree
zpe.sumelectthermal: -2129.268366 hartree
zpe.sumelectthermalent: -2129.267422 hartree
zpe.sumelectthermalfe: -2129.326059 hartree
dipole: 0.0000 0.0000 0.0061
dipole: 0.0061
quadrupole: -94.7189 -122.8513 -142.6833
quadrupole: -0.0001 -0.0001 0.0000
quadrupole: 25.3656 -2.7668 -22.5988 -0.0001 -0.0001 0.0000
hfenergy: -2129.4558299 hartree
pointgroup: C01 [X(C14H8S4)]
dipole: -0.0000069 0.0000042 -0.0024173 debye
dipolederiv: -0.7070924 0.0282262 0.0005483 -0.2010184 -0.0967962 -0.0000044 -0.0000958 -0.0000195 0.0631955 -0.7070839 -0.0282228 0.0005399 0.2010121 -0.0968016 0.0000083 -0.000098 0.0000198 0.0631918 -0.7070991 0.0282239 -0.0005454 -0.201023 -0.0967972 0.000009 0.0001116 0.0000182 0.0631947 -0.7070791 -0.0282203 -0.0005328 0.2010113 -0.0968009 -0.0000128 0.0001256 -0.0000149 0.0631926 0.5324511 -0.0000037 0.0003232 0.0000073 0.1681741 0.0000055 -0.0002683 0.0000056 -0.1543018 0.5324529 -0.0000015 -0.0003511 0.0000158 0.1681726 -0.000005 0.0002434 -0.0000065 -0.1543022 0.6453187 -0.2877271 -0.0008644 -0.658618 -0.0654162 0.000576 -0.000589 0.0003354 -0.029979 0.6453042 0.287728 -0.0008267 0.6586221 -0.0654146 -0.0005753 -0.0005357 -0.0003303 -0.0299803 0.6453198 -0.2877266 0.0008792 -0.6586202 -0.0654119 -0.0005781 0.0005907 -0.00034 -0.0299774 0.6453049 0.2877271 0.0008296 0.6586157 -0.065419 0.0005751 0.0005202 0.0003309 -0.0299818 -0.1379297 0.0837014 0.0000143 0.0726598 0.0853748 -0.0000433 0.0001037 -0.0001488 -0.12266 -0.1379246 -0.0837019 0.0000072 -0.0726657 0.0853747 0.0000232 0.0000928 0.0001271 -0.1226588 -0.1379299 0.0837003 -0.0000157 0.0726623 0.0853723 0.0000439 -0.0001053 0.0001485 -0.1226603 -0.137925 -0.0837033 -0.0000067 -0.0726634 0.0853769 -0.0000202 -0.0000984 -0.0001244 -0.1226587 -0.067426 0.0255187 -0.0002488 0.0809844 0.0096817 -0.0000754 -0.0002117 -0.0000426 -0.1659357 -0.0674315 -0.025518 -0.0002369 -0.0809829 0.0096812 0.0000615 -0.0001915 0.0000322 -0.1659359 -0.0674264 0.0255196 0.0002507 0.080985 0.009681 0.0000735 0.000212 0.0000434 -0.1659353 -0.0674313 -0.0255178 0.0002446 -0.0809846 0.0096824 -0.0000629 0.0002022 -0.0000358 -0.1659356 0.1008013 0.0344631 0.000116 -0.015656 -0.0579928 0.0000353 0.0001137 -0.0000412 0.1653785 0.1008019 -0.0344629 0.0001157 0.0156571 -0.0579932 -0.0000173 0.0000992 0.0000559 0.1653783 0.1008017 0.0344618 -0.0001171 -0.0156563 -0.0579918 -0.0000351 -0.0001156 0.0000425 0.1653789 0.1008007 -0.0344623 -0.0001177 0.0156574 -0.0579941 0.0000167 -0.0000985 -0.0000573 0.1653779 -0.0998942 -0.0817598 0.0003202 -0.0882452 0.0410644 0.0001209 0.0003349 0.0001228 0.1671538 -0.0998941 0.081759 0.0003115 0.0882435 0.0410658 -0.0001095 0.0003298 -0.000112 0.167154 -0.099896 -0.0817594 -0.0003219 -0.0882453 0.041064 -0.0001212 -0.0003357 -0.0001235 0.1671532 -0.0998941 0.0817583 -0.0003153 0.0882451 0.0410636 0.0001117 -0.0003364 0.0001146 0.1671535 unknown
polarizability: 427.2883461|-0.000234|203.8590734|-0.0005975|-0.000251|74.0886178 unknown
InChI: InChI=1S/C14H8S4/c1-2-6-10-9(5-1)15-13(16-10)14-17-11-7-3-4-8-12(11)18-14/h1-8H
charge 0 multiplicity 1
26 atoms
S  1.66467 1.548866 0.002326
S  1.664674 -1.548863 0.002299
S  -1.664657 -1.548851 0.002403
S  -1.664653 1.548876 0.002358
C  0.679637 0.000008 0.002178
C  -0.679623 0.0000 0.002212
C  3.285438 0.708284 -0.000207
C  3.285444 -0.708276 -0.000182
C  -3.285428 -0.708264 -0.000171
C  -3.285424 0.708297 -0.000136
C  4.501277 1.421539 -0.001885
C  4.501285 -1.421523 -0.001789
C  -4.501268 -1.421515 -0.001856
C  -4.501264 1.421547 -0.001763
C  5.72206 0.70701 -0.003471
C  5.722065 -0.706988 -0.00341
C  -5.722047 -0.706981 -0.003458
C  -5.722046 0.707016 -0.0034
H  4.500752 2.516304 -0.001968
H  4.500764 -2.516288 -0.001785
H  -4.500748 -2.516279 -0.001934
H  -4.500742 2.516313 -0.001756
H  6.667868 1.258397 -0.004782
H  6.667876 -1.25837 -0.004666
H  -6.667857 -1.258366 -0.004777
H  -6.667853 1.258404 -0.004677
