program: Gaussian 09
title: 000141117
version: EM64L-G09RevD.01
frameworkgroup: C1[X(C10H16)]
method: RPBEPBE
basis: SDD
operation: Freq
keyword: #p
keyword: freq=noraman
keyword: PBEPBE/SDD
title: #p freq=noraman PBEPBE/SDD
converged: YES YES NO NO
title: Mulliken charges:
elementType: C C C C C C C C C C H H H H H H H H H H H H H H H H
charge: 0.466563 0.466572 -0.578790 -0.555472 -0.515773 -0.515772 -0.515779 -0.515781 -0.578801 -0.555466 0.225186 0.225187 0.223177 0.223176 0.206915 0.194345 0.194343 0.206917 0.206915 0.194347 0.194346 0.206916 0.225187 0.225187 0.223176 0.223177
chargesum: 0.00000
title: Mulliken charges with hydrogens summed into heavy atoms:
elementType: C C C C C C C C C C
charge: 0.466563 0.466572 -0.128417 -0.109119 -0.114512 -0.114511 -0.114517 -0.114519 -0.128428 -0.109113
polarizability: 1.18865606e+02 -1.38097088e-05 9.08658661e+01 -4.52705864e-02 -3.71041379e-06 9.03741516e+01
1716.lowfreq: -33.3999 -11.0827 -0.0007 -0.0003 -0.0003 28.3591 81.4690 157.5359 168.8925
frequency: 81.4690 157.5359 168.8751 247.2481 282.1098 338.5047 347.0455 365.1297 373.3478 459.0393 461.8261 566.0377 667.2412 676.1928 771.9851 773.8286 798.8859 845.3136 860.3264 887.0572 887.2848 906.3041 922.5464 930.8168 933.8348 993.6659 1007.3210 1017.4284 1022.1617 1023.5602 1025.2904 1052.3171 1058.6192 1093.4063 1136.7363 1146.1564 1158.8322 1167.6679 1177.0646 1189.0823 1282.4840 1295.0702 1297.5370 1324.0653 1333.3193 1340.5223 1357.4213 1387.0562 1439.5873 1440.0593 1456.1126 1458.4941 1461.5694 1469.1566 1473.2917 1477.0111 2961.1331 2962.7828 2964.4679 2967.1731 3017.9331 3022.6303 3027.3966 3032.1412 3076.1560 3076.2505 3085.7143 3085.9943 3170.8886 3170.8987 3188.6846 3189.0148
redmass: 3.3525 2.3193 3.2591 2.1458 2.0407 2.8133 2.3164 1.9577 1.7135 2.3623 2.8966 3.1376 3.9879 2.2432 1.0416 1.0372 1.4928 3.0770 1.6722 1.1974 2.9059 1.1634 4.5920 3.0037 1.3657 2.6791 1.5625 1.6486 1.9301 1.2825 1.4148 1.4665 1.3765 2.2785 1.1115 1.3022 1.2660 1.6791 1.5227 1.4346 1.6855 1.5322 1.4235 1.2926 2.1332 2.2980 2.4228 1.8670 1.0861 1.0880 1.0802 1.0914 1.1992 1.3335 1.1251 1.2474 1.0585 1.0637 1.0590 1.0646 1.0980 1.0979 1.1034 1.1031 1.0510 1.0510 1.0625 1.0625 1.1163 1.1163 1.1145 1.1143
irintensity: 0.0253 0.2215 0.0000 0.1484 0.0000 0.0000 0.0000 1.3651 0.0524 0.0000 0.0000 3.7268 0.0000 11.1636 2.6100 0.0000 0.0000 0.0000 0.1221 0.4635 17.9593 0.0000 0.0000 33.2571 0.0000 1.1910 3.2172 5.9044 0.0000 49.0590 0.0000 0.0000 10.5910 0.0000 0.0000 0.6412 0.0000 5.2165 1.8913 0.0000 0.0000 9.2280 0.0935 0.0000 0.1617 0.0000 0.0000 2.7368 21.5496 0.0000 0.0000 17.9188 7.2907 0.0000 0.0000 16.9512 0.0000 64.7838 81.6640 0.0000 75.0480 0.0001 0.0000 123.7204 0.0043 61.4742 33.1982 0.0003 0.0000 0.0236 0.0001 67.7554
temp: 298.150 k
press: 1.00000 atm
elementType: 6 6 6 6 6 6 6 6 6 6 1 1 1 1 1 1 1 1 1 1 1 1 1 1 1 1
symmnumber: 1
zpe: 611717.1 jmol-1
zpe.correction: 0.232991 hartree
zpe.thermalcorrener: 0.242358 hartree
zpe.thermalcorrenthalpy: 0.243302 hartree
zpe.thermalcorrgfe: 0.199287 hartree
zpe.sumelectzpe: -389.814197 hartree
zpe.sumelectthermal: -389.804830 hartree
zpe.sumelectthermalent: -389.803886 hartree
zpe.sumelectthermalfe: -389.847901 hartree
dipole: 0.0000 0.0000 0.0000
dipole: 0.0000
quadrupole: -66.1806 -59.5616 -63.1172
quadrupole: 0.0000 0.1656 0.0000
quadrupole: -3.2275 3.3916 -0.1640 0.0000 0.1656 0.0000
hfenergy: -390.0471879 hartree
pointgroup: C01 [X(C10H16)]
dipole: -0.0000019 -0.000003 0.0000037 debye
dipolederiv: -0.0539937 -0.0000013 -0.0552781 -0.0000022 0.0742677 -0.0000024 -0.0244023 -0.0000014 0.1824601 -0.0539806 -0.0000008 -0.0552905 0. 0.07427 -0.0000005 -0.0244262 -0.0000005 0.182453 -0.1698873 -0.000002 0.0723021 -0.0000035 0.0890635 0.0000027 0.1425248 0.0000043 -0.0826488 -0.0153312 0.0000015 -0.0522485 0.0000021 0.0664832 0.0000028 -0.0851057 0.0000015 -0.1903003 0.0624404 -0.0111239 0.0418968 -0.0850974 0.0767877 -0.0217586 0.007991 -0.0182264 0.130486 0.0624418 0.0111241 0.0418964 0.0850989 0.0767871 0.0217594 0.007991 0.0182263 0.1304894 0.0624361 0.0111198 0.0418972 0.0850922 0.0767869 0.0217582 0.0079937 0.0182249 0.1304886 0.0624332 -0.0111233 0.0418995 -0.0850928 0.0767916 -0.0217597 0.0079933 -0.0182269 0.1304858 -0.1698885 0.0000034 0.072302 0.0000019 0.0890625 0.0000025 0.1425206 0.000005 -0.0826391 -0.0153338 0.0000041 -0.0522427 0.0000035 0.0664827 0.000004 -0.0850971 0.0000016 -0.1903104 0.0243892 -0.0467782 0.0629529 -0.1087568 -0.0671332 0.0787111 0.0730506 0.0428873 0.0442879 0.0243868 0.0467784 0.0629554 0.1087562 -0.0671268 -0.0787129 0.0730541 -0.04289 0.0442844 0.1044371 0.0122465 -0.0117492 0.0398983 -0.0646501 0.1080737 -0.0318938 0.0650027 -0.0198686 0.1044376 -0.0122453 -0.0117488 -0.0398965 -0.0646492 -0.1080751 -0.0318942 -0.0650035 -0.0198714 0.0056374 0.0445795 -0.0680361 0.0519349 0.0586726 -0.0066823 -0.052577 0.0441873 -0.1724967 -0.0772943 -0.1431887 -0.0074583 -0.1072665 -0.118589 -0.0139604 -0.0130819 -0.0532839 0.0628378 -0.0772989 0.1431903 -0.0074578 0.1072681 -0.1185846 0.0139592 -0.0130838 0.0532835 0.0628367 0.0056386 -0.0445797 -0.0680339 -0.0519358 0.0586712 0.0066825 -0.0525741 -0.0441868 -0.1724968 0.0056405 -0.0445759 -0.0680391 -0.0519308 0.0586746 0.0066927 -0.0525763 -0.0441769 -0.1725013 -0.0772975 0.1431884 -0.0074509 0.1072678 -0.1185906 0.0139535 -0.013078 0.0532771 0.0628406 -0.0772922 -0.1431871 -0.0074552 -0.1072662 -0.118595 -0.0139583 -0.0130815 -0.053283 0.0628392 0.0056393 0.0445781 -0.068038 0.0519322 0.0586743 -0.0066868 -0.0525749 0.0441824 -0.1724992 0.0243807 0.0467793 0.0629544 0.1087589 -0.0671278 -0.0787091 0.0730533 -0.0428897 0.0442907 0.0243765 -0.0467845 0.0629549 -0.1087636 -0.0671312 0.0787051 0.0730506 0.042884 0.044296 0.1044414 -0.0122443 -0.0117434 -0.0398921 -0.0646494 -0.1080757 -0.031889 -0.0650026 -0.0198722 0.1044415 0.0122417 -0.0117411 0.0398892 -0.0646487 0.1080743 -0.0318869 0.0650035 -0.0198715 unknown
polarizability: 118.8656766|0.0001717|90.8658661|-0.0069141|0.|90.3740814 unknown
InChI: InChI=1S/C10H16/c1-2-10(7-8-10)4-3-9(1)5-6-9/h1-8H2
charge 0 multiplicity 1
26 atoms
C  1.459481 0.000021 -0.197356
C  -1.459466 -0.00001 0.197273
C  2.95417 0.000034 -0.529557
C  2.492429 0.000016 0.943149
C  0.643454 1.276358 -0.432177
C  0.643476 -1.276329 -0.432198
C  -0.643454 1.276332 0.432148
C  -0.643436 -1.276342 0.432123
C  -2.954171 -0.000008 0.529392
C  -2.49235 0.000006 -0.943288
H  3.399366 0.91892 -0.926247
H  3.399381 -0.918835 -0.926272
H  2.629746 -0.918813 1.523609
H  2.629737 0.918839 1.523621
H  0.361651 1.335866 -1.504083
H  1.256411 2.171301 -0.205965
H  1.256452 -2.171261 -0.205984
H  0.361685 -1.335836 -1.504106
H  -0.361656 1.335793 1.504058
H  -1.256419 2.17128 0.205976
H  -1.256384 -2.171295 0.205923
H  -0.36164 -1.33583 1.504032
H  -3.399392 0.918864 0.926089
H  -3.399405 -0.918888 0.926056
H  -2.629638 -0.918818 -1.523761
H  -2.629628 0.918835 -1.523756
