program: Gaussian 09
title: 000011257
version: EM64L-G09RevD.01
frameworkgroup: C1[X(C14H14N2O3S)]
method: RPBEPBE
basis: SDD
operation: Freq
keyword: #p
keyword: freq=noraman
keyword: PBEPBE/SDD
title: #p freq=noraman PBEPBE/SDD
converged: YES YES NO NO
title: Mulliken charges:
elementType: S O O O N N C C C C C C C C C C C C C C H H H H H H H H H H H H H H
charge: 0.865650 -0.540026 -0.546942 -0.248685 -0.454085 -0.690417 -0.092970 -0.102869 -0.232131 -0.217366 -0.216414 -0.213339 0.497871 -0.325914 -0.430791 -0.393008 -0.393598 0.512374 0.226635 -0.779051 0.275184 0.281229 0.274171 0.273084 0.317508 0.228067 0.227795 0.228750 0.305957 0.312498 0.313122 0.262502 0.261219 0.213988
chargesum: 0.00000
title: Mulliken charges with hydrogens summed into heavy atoms:
elementType: S O O O N N C C C C C C C C C C C C C C
charge: 0.865650 -0.540026 -0.546942 -0.248685 -0.148128 -0.064798 -0.092970 -0.102869 0.043053 0.063863 0.057757 0.059745 0.497871 -0.008406 -0.202724 -0.165212 -0.164848 0.512374 0.226635 -0.041342
polarizability: 2.92977233e+02 -1.02693572e+01 1.63632038e+02 4.88523312e+00 1.15200817e+01 1.84593106e+02
1716.lowfreq: -1.6464 -0.0018 -0.0009 0.0005 5.9096 7.6452 21.0352 28.5486 38.0783
frequency: 20.9276 28.5215 38.0559 44.9650 67.2717 73.8638 95.9755 117.8176 138.3972 166.7326 183.4110 209.5491 226.7711 270.6190 293.7425 327.5450 329.3153 362.0460 376.2782 401.9722 412.4922 413.3774 413.6893 415.2653 422.6232 469.4851 520.1217 530.1470 548.5697 596.8925 606.0754 620.6905 624.2764 644.4368 675.6626 722.7618 733.3260 777.7848 809.2637 818.4931 823.4886 835.3874 837.9615 873.5159 917.7415 932.1067 952.4356 960.5341 964.4461 983.3001 989.4149 994.6572 997.9438 1020.5082 1040.4336 1052.1060 1058.3518 1118.3022 1129.4426 1178.5767 1183.5508 1214.4053 1262.3432 1292.9340 1297.1681 1318.7932 1370.6338 1390.1970 1398.7299 1403.9439 1430.2369 1448.3455 1469.2047 1476.4942 1490.2915 1502.4950 1588.7063 1597.8220 1602.5325 1614.2764 1630.0887 1646.8770 2996.9300 3098.9175 3100.2482 3119.2587 3130.8515 3132.9538 3154.4184 3157.2434 3159.9750 3161.1894 3196.6463 3533.7953 3564.0157 3703.1646
redmass: 5.7990 4.1781 3.7985 1.2172 3.2675 4.5766 7.9091 5.0108 6.5114 5.4152 7.4515 7.0774 8.9839 6.9928 5.6855 6.4229 6.2229 4.4505 3.6709 1.0413 1.7743 2.4876 2.9630 3.1363 4.3906 7.1563 2.7854 2.7603 4.5701 3.1693 6.7956 6.9761 6.9284 1.2010 6.2049 3.0146 3.3734 13.3647 4.9336 1.2587 4.5944 1.5275 1.7033 1.4508 13.7879 6.5221 1.3675 1.3803 1.3600 4.7440 3.0934 1.9598 1.3390 1.4313 1.6381 2.4740 2.4543 1.2965 1.1953 1.1241 1.1208 3.4586 1.8651 1.3965 1.3083 2.6729 4.2445 1.2344 5.7138 4.7264 3.6725 1.0449 1.1286 2.2019 2.9279 2.2815 7.4105 6.6927 6.1670 4.7582 4.8296 1.2276 1.0363 1.1004 1.0982 1.0901 1.0888 1.0886 1.0912 1.0950 1.0958 1.0955 1.0950 1.0766 1.0452 1.1040
irintensity: 1.4442 4.7859 1.7185 1.2405 0.1883 6.0040 2.3273 1.2211 1.2819 2.7770 4.0120 5.3316 9.5664 2.3653 16.0722 4.2179 3.0046 10.5594 1.6925 0.3326 149.2901 44.4650 16.5850 18.2833 91.3133 100.9462 28.8028 72.8930 92.9362 1.0089 57.2308 6.3755 0.9625 54.7564 8.4771 1.7838 2.1257 94.5446 24.6332 0.3281 13.7400 27.3685 60.2578 43.6326 66.1719 8.0308 2.2121 0.9377 0.3306 2.1664 5.1122 13.2719 3.2053 0.8167 15.1324 76.3615 18.7949 7.8393 21.1749 70.6464 9.2613 54.8856 59.9637 43.7628 7.8452 80.0519 245.0254 46.2259 9.4639 11.4386 2.1774 15.5221 17.6388 43.6917 94.7669 439.3225 3.4837 99.8270 14.6106 146.6448 111.7172 265.6812 11.7996 17.4888 6.9354 17.9477 13.7028 15.5600 1.7536 3.0731 13.6349 6.4271 7.7856 13.5483 107.0372 24.2990
temp: 298.150 k
press: 1.00000 atm
elementType: 16 8 8 8 7 7 6 6 6 6 6 6 6 6 6 6 6 6 6 6 1 1 1 1 1 1 1 1 1 1 1 1 1 1
symmnumber: 1
zpe: 670205.1 jmol-1
zpe.correction: 0.255268 hartree
zpe.thermalcorrener: 0.274826 hartree
zpe.thermalcorrenthalpy: 0.275771 hartree
zpe.thermalcorrgfe: 0.205004 hartree
zpe.sumelectzpe: -1273.549034 hartree
zpe.sumelectthermal: -1273.529475 hartree
zpe.sumelectthermalent: -1273.528531 hartree
zpe.sumelectthermalfe: -1273.599298 hartree
dipole: 0.2238 7.6299 -5.1537
dipole: 9.2101
quadrupole: -82.0666 -134.9586 -118.7506
quadrupole: -28.1586 -15.2774 0.9034
quadrupole: 29.8586 -23.0333 -6.8254 -28.1586 -15.2774 0.9034
hfenergy: -1273.8043012 hartree
pointgroup: C01 [X(C14H14N2O3S1)]
dipole: 0.0277566 -3.0072565 2.0212987 debye
polarizability: 293.3225259|8.2097719|163.2969172|-3.9229783|11.6052929|184.5829342 unknown
InChI: InChI=1S/C14H14N2O3S/c1-10(17)16-12-4-8-14(9-5-12)20(18,19)13-6-2-11(15)3-7-13/h2-9,16H,15H2,1H3
charge 0 multiplicity 1
34 atoms
S  -1.340425 1.813758 -0.29232
O  -1.372769 2.279192 -1.864241
O  -1.606262 2.83776 0.96292
O  4.942877 -1.240454 -1.367273
N  4.232824 -0.450298 0.728094
N  -5.416275 -2.652718 0.2660
C  0.373442 1.067304 0.004986
C  -2.571849 0.407534 -0.11254
C  1.086569 0.552912 -1.088139
C  0.901713 1.121639 1.304742
C  -3.161081 0.186207 1.1446
C  -2.92326 -0.332142 -1.255598
C  2.935231 0.050584 0.433064
C  2.380139 0.031326 -0.877307
C  2.192746 0.603555 1.515103
C  -4.11313 -0.840845 1.270876
C  -3.874562 -1.359321 -1.126498
C  -4.477646 -1.634363 0.139598
C  5.158117 -1.05012 -0.13557
C  6.469766 -1.463682 0.527614
H  0.650744 0.585896 -2.092217
H  0.326403 1.583769 2.113422
H  -2.896895 0.825937 1.993415
H  -2.481317 -0.086273 -2.22696
H  2.966446 -0.378913 -1.700797
H  2.631163 0.635714 2.520579
H  -4.58687 -1.028399 2.241515
H  -4.163537 -1.947324 -2.005348
H  4.525651 -0.35532 1.703002
H  -5.861774 -2.844631 1.158619
H  -5.692789 -3.210502 -0.536825
H  7.30312 -0.942971 0.025244
H  6.622457 -2.545623 0.373362
H  6.517134 -1.248087 1.609177
