program: Gaussian 09
title: 000141084
version: EM64L-G09RevD.01
frameworkgroup: C1[X(C6H14O2)]
method: RPBEPBE
basis: SDD
operation: Freq
keyword: #pfreq=noraman
keyword: PBEPBE/SDD
title: #p freq=noraman PBEPBE/SDD
converged: YES YES NO NO
title: Mulliken charges:
elementType: O O C C C C C C H H H H H H H H H H H H H H
charge: -0.223468 -0.365934 -0.416486 -0.347514 0.044771 -0.348626 -0.709492 -0.695046 0.196840 0.214820 0.180249 0.216250 0.198075 0.198062 0.190336 0.201067 0.252017 0.219425 0.209053 0.211573 0.216039 0.357988
chargesum: 0.00000
title: Mulliken charges with hydrogens summed into heavy atoms:
elementType: O O C C C C C C
charge: -0.223468 -0.007946 -0.004827 0.048986 0.242846 0.039773 -0.036983 -0.058381
polarizability: 9.09907001e+01 2.88792134e+00 7.63112966e+01 -2.39269746e+00 -1.01293059e+00 6.10321573e+01
1716.lowfreq: -7.4055 -0.0007 -0.0001 0.0001 7.2809 13.0887 54.2133 65.0873 86.8208
frequency: 54.2113 65.0525 86.8146 122.1614 130.4337 152.0868 213.9511 222.6672 253.0987 276.7787 310.9071 399.8071 479.7639 502.1297 719.0247 749.7814 814.0126 841.8257 887.8109 895.7201 913.3049 1002.6727 1032.6454 1055.5971 1081.2472 1113.8043 1133.2421 1156.7539 1209.5980 1246.3061 1251.9012 1281.7850 1290.1377 1304.1477 1323.4571 1349.0150 1360.1359 1384.9388 1389.0300 1446.3464 1462.1282 1467.4775 1475.8597 1476.5742 1480.6501 1487.0123 2960.8636 2967.0406 2972.3845 2972.7305 2980.2766 2987.0704 3005.4437 3023.4861 3048.8613 3069.5742 3072.1239 3082.6103 3103.2705 3498.8297
redmass: 1.6682 3.2432 4.4740 1.6678 1.4830 2.7095 1.0708 1.1396 2.7729 2.7726 4.1381 2.6673 2.6730 3.3710 1.2323 1.4499 1.6805 11.6228 2.0414 1.5731 1.4319 1.4650 2.9700 1.8752 2.2016 1.7930 2.4656 2.0157 1.3907 1.2272 1.2984 1.2076 1.0626 1.3014 1.2383 1.5103 1.6737 1.2327 1.2191 1.0767 1.0523 1.0662 1.0687 1.0426 1.0485 1.0808 1.0600 1.0621 1.0491 1.0606 1.0703 1.0370 1.0961 1.1001 1.1028 1.1008 1.0993 1.0992 1.0995 1.0682
irintensity: 0.2955 0.4431 3.6937 59.3321 71.8822 15.7154 1.0783 0.5485 5.9330 1.1530 3.1483 3.5050 1.4598 9.8747 5.2932 8.4673 2.3398 10.0702 8.8302 0.3968 2.7461 10.4626 1.6264 15.8055 2.7677 8.4291 9.2399 8.4297 13.7652 33.1264 7.7975 4.0563 0.7675 3.3145 7.7415 5.0776 4.6593 32.2919 7.0202 3.6306 12.6166 0.1284 4.1968 12.9068 10.2959 17.0097 5.0156 28.6338 27.4030 23.1626 73.4358 29.5709 11.0241 1.5711 35.5632 92.1636 53.6391 47.8810 19.5292 11.1315
temp: 298.150 k
press: 1.00000 atm
elementType: 8 8 6 6 6 6 6 6 1 1 1 1 1 1 1 1 1 1 1 1 1 1
symmnumber: 1
zpe: 503020.0 jmol-1
zpe.correction: 0.191590 hartree
zpe.thermalcorrener: 0.202855 hartree
zpe.thermalcorrenthalpy: 0.203799 hartree
zpe.thermalcorrgfe: 0.154351 hartree
zpe.sumelectzpe: -386.711183 hartree
zpe.sumelectthermal: -386.699918 hartree
zpe.sumelectthermalent: -386.698974 hartree
zpe.sumelectthermalfe: -386.748422 hartree
dipole: 1.2461 0.0547 1.0697
dipole: 1.6431
quadrupole: -56.2161 -45.1320 -51.3835
quadrupole: 1.0690 -2.0828 -0.8554
quadrupole: -5.3055 5.7786 -0.4730 1.0690 -2.0828 -0.8554
hfenergy: -386.9027728 hartree
pointgroup: C01 [X(C6H14O2)]
dipole: -0.4945752 0.0302653 -0.4151997 debye
dipolederiv: -0.1643022 -0.1531653 -0.0558642 -0.267954 -0.3404471 0.0551635 -0.0712102 0.1233552 -0.2225192 -0.3995525 0.2730273 -0.0373719 0.3650711 -0.2441805 0.025555 0.0506211 -0.0220245 -0.3819605 -0.0310656 -0.0396384 0.0232234 0.0766345 0.0066121 -0.0237404 -0.0056915 0.029616 0.1210974 -0.0365023 -0.0353454 0.0274261 0.0127318 0.0561131 -0.0409107 0.0418138 -0.0499841 0.1486811 0.3140761 0.0822905 0.0502365 -0.0378942 0.5868828 -0.0410006 0.0927806 -0.1212642 0.3523102 0.0485666 -0.0248375 0.0048947 -0.061405 0.127191 -0.036321 -0.0241407 -0.038421 0.149311 -0.1820824 -0.1377742 -0.0019998 -0.0533361 -0.0919056 -0.002374 -0.0391023 0.0005969 0.0575796 -0.0605646 -0.058463 -0.0154885 -0.0336068 0.0478709 -0.0237509 0.0047028 -0.0208382 0.0831089 0.020389 0.0679325 -0.0091766 0.0056073 -0.1418362 0.0547803 -0.0143453 0.0770115 0.058264 0.0606942 -0.0172437 -0.0151865 -0.0409181 0.0880863 -0.0083637 -0.0125988 -0.0407147 -0.146242 0.0291375 -0.0061756 -0.0000071 -0.0084988 0.0605592 -0.0091736 -0.0043824 -0.0300612 -0.2008232 0.0679747 0.0258864 -0.0059287 0.0292908 -0.1368757 0.039799 -0.0030829 0.0610145 0.0520175 0.0371497 -0.0211907 -0.0391822 0.0164577 -0.0352781 -0.0725155 -0.0645424 -0.0077727 -0.1845744 0.0303448 -0.0148616 -0.0397971 -0.0073305 0.0647712 -0.0175106 -0.0027724 -0.0389344 -0.2011412 0.0216063 0.0087365 -0.0005676 0.0429442 -0.1932983 0.0508942 -0.0117674 0.0812586 0.0531999 0.0946326 0.0462299 -0.0501385 0.0209917 -0.0922349 0.1064435 -0.0334238 0.1195667 0.0088033 -0.1092528 0.0236695 0.0437775 0.0685536 0.0899371 -0.0229311 0.0494303 -0.0246204 0.0922016 0.0911249 -0.0026174 0.0345187 -0.0292823 0.0631431 -0.0474255 -0.0161705 -0.0925856 -0.1292261 0.0837289 -0.014124 0.0060721 -0.0236647 0.074719 0.0034303 -0.0569826 -0.0246376 -0.1887574 0.0768289 0.0613491 -0.031647 -0.0055087 -0.1603885 0.0643748 -0.0233036 0.0791527 0.060767 -0.1992752 0.0362858 0.0755825 0.0627508 0.0645867 -0.0364283 0.0958092 -0.0314172 0.0609884 0.2063434 -0.0999708 0.0366244 -0.1316342 0.1059724 -0.017995 0.0483594 -0.0282965 0.356914 unknown
polarizability: 90.9723425|-2.7163546|76.209367|-2.7763438|1.4488677|61.1524445 unknown
InChI: InChI=1S/C6H14O2/c1-3-4-5-6(2)8-7/h6-7H,3-5H2,1-2H3
charge 0 multiplicity 1
22 atoms
O  1.55266 -0.829935 0.444516
O  2.828554 -1.423106 -0.180295
C  -0.135376 0.825703 0.186444
C  -1.282876 -0.110166 -0.252733
C  1.259084 0.407291 -0.326874
C  -2.658459 0.336288 0.292885
C  2.345894 1.465638 -0.096497
C  -3.809966 -0.589906 -0.154094
H  -0.327316 1.854765 -0.178849
H  -0.097318 0.886094 1.292847
H  -1.324692 -0.146893 -1.361684
H  -1.064772 -1.140441 0.089087
H  1.206857 0.129809 -1.400633
H  -2.616649 0.36777 1.400822
H  -2.865941 1.374214 -0.039995
H  2.15882 2.353703 -0.728467
H  3.337138 1.056207 -0.35337
H  2.361575 1.782801 0.961673
H  -3.894981 -0.613477 -1.257057
H  -3.639374 -1.627175 0.190771
H  -4.781643 -0.254088 0.252451
H  2.530579 -2.372896 -0.254751
