program: Gaussian 09
title: 000141081
version: EM64L-G09RevD.01
frameworkgroup: C1[X(C14H24N2)]
method: RPBEPBE
basis: SDD
operation: Freq
keyword: #pfreq=noraman
keyword: PBEPBE/SDD
title: #p freq=noraman PBEPBE/SDD
converged: YES YES NO NO
title: Mulliken charges:
elementType: N N C C C C C C C C C C C C C C H H H H H H H H H H H H H H H H H H H H H H H H
charge: -0.110329 -0.110330 -0.393236 -0.362625 -0.393235 -0.362626 -0.384978 -0.377895 -0.384978 -0.377894 -0.493922 -0.502517 -0.493923 -0.502513 0.155955 0.155950 0.201636 0.187303 0.186483 0.197538 0.201636 0.187303 0.186484 0.197537 0.214909 0.200660 0.188051 0.199115 0.214909 0.200660 0.188051 0.199115 0.225188 0.192259 0.225427 0.250980 0.225188 0.192260 0.225428 0.250978
chargesum: 0.00000
title: Mulliken charges with hydrogens summed into heavy atoms:
elementType: N N C C C C C C C C C C C C C C
charge: -0.110329 -0.110330 -0.004297 0.021396 -0.004297 0.021395 0.030591 0.009270 0.030591 0.009271 -0.076475 -0.026110 -0.076475 -0.026107 0.155955 0.155950
polarizability: 2.41636061e+02 -5.33853182e+00 1.45397758e+02 -2.87481681e-04 9.55659371e-04 1.29894641e+02
1716.lowfreq: -0.0003 0.0007 0.0008 4.8697 9.0572 18.8050 30.1279 44.9007 45.3352
frequency: 29.4404 44.9004 45.2028 75.8436 77.3641 147.1472 169.9328 197.4447 216.1475 237.6753 292.5330 312.7350 321.1393 327.4805 332.8928 343.5655 422.9995 426.4767 456.2848 467.9194 490.0197 518.1142 555.8594 595.1914 617.8295 701.4684 718.7845 782.9674 792.1622 805.4266 806.8427 834.9041 849.8987 852.0246 859.8035 884.0423 896.9900 925.4172 952.8148 960.6225 981.2536 988.3655 1004.0982 1017.4720 1055.1801 1055.1863 1075.7855 1076.4617 1128.1007 1128.8902 1139.6929 1147.1936 1179.1908 1186.3358 1194.4475 1195.5817 1211.6081 1217.2996 1258.0350 1258.1765 1263.5710 1267.9247 1285.4861 1286.8742 1316.9081 1323.3156 1329.1340 1331.3970 1343.1306 1343.3660 1347.0344 1348.8832 1351.5473 1352.9166 1357.8931 1358.2641 1444.2822 1445.2468 1456.2144 1456.3664 1461.5927 1461.6676 1462.9098 1462.9181 1469.9292 1470.2415 1477.1364 1477.3248 1562.9584 1581.1556 2952.2834 2952.8761 2955.0506 2955.1105 2966.4288 2966.5228 2967.9027 2968.1711 2974.2979 2974.4562 2979.2171 2979.6676 2996.6712 2997.8654 3013.6294 3013.9186 3024.6488 3024.7760 3026.3788 3026.4746 3037.2929 3037.5447 3060.4507 3060.5076
redmass: 3.6616 3.1583 2.9197 3.4158 4.0940 2.3888 2.6714 2.2473 1.9494 2.8128 2.6193 2.9646 2.1907 2.1704 2.2481 2.5271 2.5102 2.6878 1.6843 2.9362 1.9628 2.4375 2.4503 4.6917 2.3769 2.7901 3.5302 3.2313 2.4291 1.4945 1.6055 1.5029 2.2242 1.5454 2.5113 2.5664 2.1800 2.5834 2.1834 2.1556 1.5241 1.6739 2.2247 2.1872 1.5991 1.7042 1.9309 1.9088 2.2848 2.0903 1.3145 1.4161 1.2519 1.2808 1.3900 1.3939 1.4342 1.3816 1.3004 1.2713 1.3661 1.3017 1.3102 1.3989 1.4411 1.5456 1.5131 1.5432 1.4967 1.5082 1.5525 1.5298 1.3730 1.4156 1.4416 1.4256 1.0829 1.0809 1.1097 1.1128 1.0849 1.0845 1.0855 1.0858 1.0910 1.0908 1.0822 1.0830 7.7726 8.3057 1.0606 1.0609 1.0612 1.0612 1.0614 1.0614 1.0662 1.0662 1.0619 1.0619 1.0638 1.0640 1.0951 1.0951 1.0973 1.0972 1.0993 1.0994 1.1006 1.1002 1.1016 1.1014 1.0983 1.0983
irintensity: 0.5559 0.2916 0.1999 2.1094 1.0682 1.2591 0.0707 0.9644 0.2054 4.3469 0.2704 1.3206 0.1080 0.9274 0.0299 0.1525 0.0468 2.2278 0.8810 4.6584 2.4786 0.0026 0.3477 8.0689 0.2385 4.4492 0.0064 0.0016 2.1401 4.9601 0.7039 2.8845 6.0641 5.6530 13.2265 1.3423 10.1996 0.0886 25.9869 0.6288 2.1278 4.6466 1.0169 0.0456 11.0330 0.8685 1.0072 1.0325 5.3866 0.4221 0.0338 0.1738 12.7859 0.0701 0.7090 1.4984 5.4788 5.2677 0.0052 2.4247 6.0866 0.0484 0.4490 0.1377 1.9189 3.2309 0.0766 5.8389 1.5004 0.0018 4.1638 1.1783 10.2733 0.5959 3.5903 0.0714 2.2525 15.6144 37.7602 1.9676 1.0478 11.4887 10.6100 0.9125 1.5970 16.8961 9.2214 23.9230 0.7555 99.5870 20.1678 1.8453 59.7219 2.5150 9.4423 43.9942 45.0965 13.1862 46.2703 28.0183 24.4832 31.6408 4.6723 40.5916 73.8954 59.5483 139.6736 6.7111 49.6806 11.2068 143.9720 64.5552 30.9648 17.4750
temp: 298.150 k
press: 1.00000 atm
elementType: 7 7 6 6 6 6 6 6 6 6 6 6 6 6 6 6 1 1 1 1 1 1 1 1 1 1 1 1 1 1 1 1 1 1 1 1 1 1 1 1
symmnumber: 1
zpe: 937001.4 jmol-1
zpe.correction: 0.356885 hartree
zpe.thermalcorrener: 0.372857 hartree
zpe.thermalcorrenthalpy: 0.373801 hartree
zpe.thermalcorrgfe: 0.312750 hartree
zpe.sumelectzpe: -656.086769 hartree
zpe.sumelectthermal: -656.070797 hartree
zpe.sumelectthermalent: -656.069853 hartree
zpe.sumelectthermalfe: -656.130904 hartree
dipole: 0.0000 0.0001 -1.1790
dipole: 1.1790
quadrupole: -87.9751 -98.3908 -97.8722
quadrupole: -0.5527 0.0000 -0.0001
quadrupole: 6.7709 -3.6448 -3.1262 -0.5527 0.0000 -0.0001
hfenergy: -656.4436543 hartree
pointgroup: C01 [X(C14H24N2)]
dipole: -0.0000086 -0.0000475 0.4638667 debye
polarizability: 241.7201145|4.5170414|145.3137043|0.0002956|0.0009532|129.8946406 unknown
InChI: InChI=1S/C14H24N2/c1-2-6-10-13(9-5-1)15-16-14-11-7-3-4-8-12-14/h1-12H2
charge 0 multiplicity 1
40 atoms
N  0.431237 0.56316 -0.171855
N  -0.431216 -0.563031 -0.171938
C  4.752227 0.31327 -0.945646
C  4.333805 -1.124906 -0.553127
C  -4.752235 -0.313174 -0.945658
C  -4.333865 1.124973 -0.552972
C  3.590765 1.304526 -1.183842
C  3.65327 -1.233789 0.836551
C  -3.590741 -1.304361 -1.183984
C  -3.653298 1.233714 0.836703
C  2.633887 1.511438 0.030853
C  2.131446 -0.964814 0.834291
C  -2.633842 -1.511382 0.030674
C  -2.131464 0.964796 0.834372
C  1.672189 0.355467 0.230794
C  -1.672175 -0.355404 0.230723
H  5.368231 0.269787 -1.866827
H  5.412578 0.715684 -0.148366
H  5.243452 -1.75807 -0.55525
H  3.659062 -1.544534 -1.327629
H  -5.368252 -0.269604 -1.866826
H  -5.412561 -0.715706 -0.148417
H  -5.243539 1.758096 -0.554993
H  -3.659158 1.544726 -1.327438
H  2.985884 0.977463 -2.052748
H  4.019655 2.29082 -1.45162
H  4.166474 -0.550548 1.544181
H  3.802623 -2.256358 1.236409
H  -2.98588 -0.977174 -2.052858
H  -4.019599 -2.290638 -1.451873
H  -4.16646 0.55037 1.544264
H  -3.802678 2.25623 1.236685
H  2.027913 2.418394 -0.142755
H  3.240062 1.67632 0.944462
H  1.747077 -1.028038 1.874907
H  1.592591 -1.766583 0.286946
H  -2.027843 -2.418301 -0.143043
H  -3.2400 -1.676383 0.944273
H  -1.747068 1.027923 1.874984
H  -1.592652 1.766642 0.287096
