program: Gaussian 09
title: 000141080
version: EM64L-G09RevD.01
frameworkgroup: C1[X(C8H11NOS)]
method: RPBEPBE
basis: SDD
operation: Freq
keyword: #p
keyword: freq=noraman
keyword: PBEPBE/SDD
title: #p freq=noraman PBEPBE/SDD
converged: YES YES NO NO
title: Mulliken charges:
elementType: S O N C C C C C C C C H H H H H H H H H H H
charge: -0.080716 -0.393330 -0.106298 -0.362769 0.362558 -0.553153 -0.332274 -0.657516 0.422852 -0.797846 -0.265086 0.228546 0.264500 0.236324 0.265952 0.210508 0.225030 0.241969 0.244030 0.242401 0.263522 0.340795
chargesum: 0.00000
title: Mulliken charges with hydrogens summed into heavy atoms:
elementType: S O N C C C C C C C C
charge: -0.080716 -0.052536 -0.106298 0.130277 0.362558 -0.553153 -0.095950 0.043974 0.422852 -0.069446 -0.001563
polarizability: 1.46744427e+02 -1.52390158e+01 1.45642241e+02 2.22442142e+00 6.02149499e+00 6.09848620e+01
1716.lowfreq: -10.2834 -6.8241 -0.0009 0.0020 0.0021 10.7649 78.5275 110.7381 134.3811
frequency: 78.4973 110.7019 134.3606 180.2297 205.1418 220.9580 283.9723 330.0557 338.4096 342.3192 386.9342 440.3092 462.8081 512.9604 535.0482 580.2727 605.0783 674.1827 713.3700 723.4576 771.5766 819.6145 842.7350 918.2165 927.8760 993.6194 1025.9041 1043.5737 1089.0936 1110.7617 1134.0938 1175.8778 1227.1730 1247.4634 1256.5031 1293.8504 1340.6914 1353.3963 1389.8612 1407.4054 1410.0962 1429.9216 1460.5432 1466.7420 1470.3923 1486.7797 1490.1802 1577.2706 1622.4933 2978.5102 2993.5627 3028.3241 3056.3631 3086.9103 3089.8787 3093.8373 3101.9966 3112.7679 3167.1744 3185.3600
redmass: 4.5706 3.1077 3.7499 3.6595 1.0359 1.0641 5.4141 4.9803 3.3742 5.6187 2.5953 4.5476 5.9676 3.9624 3.2372 4.7522 4.0943 1.1441 4.5899 4.8227 1.4787 1.3217 2.3758 1.3629 3.0870 1.7482 2.2899 1.4798 2.0378 1.9261 1.3999 2.9160 3.9598 1.9295 1.8409 2.1508 1.9499 1.3701 1.2195 1.4223 1.8416 2.5043 1.0774 1.0629 1.0480 1.0584 1.1006 7.2726 5.3592 1.0400 1.0359 1.0636 1.0963 1.0976 1.0633 1.1006 1.0973 1.1013 1.0894 1.0974
irintensity: 0.7782 0.2419 0.6566 0.6637 0.1566 0.3427 4.5857 9.6072 4.7786 3.6307 1.2828 5.3695 1.0895 0.0909 15.5337 5.0350 3.9996 103.2972 5.2637 6.7704 3.1133 44.2031 19.7969 1.2650 10.4349 5.5374 9.4622 6.4442 12.6501 30.2469 5.5044 23.1394 103.5017 126.4755 65.9150 51.3237 7.0649 11.3351 25.6616 14.7462 25.4616 243.4842 24.8180 7.2670 13.6521 13.9798 18.0929 24.1753 13.6551 29.4418 25.5393 22.9463 15.1544 11.7159 119.0252 18.6149 18.6691 15.1184 8.0349 4.5762
temp: 298.150 k
press: 1.00000 atm
elementType: 16 8 7 6 6 6 6 6 6 6 6 1 1 1 1 1 1 1 1 1 1 1
symmnumber: 1
zpe: 463777.0 jmol-1
zpe.correction: 0.176643 hartree
zpe.thermalcorrener: 0.187458 hartree
zpe.thermalcorrenthalpy: 0.188402 hartree
zpe.thermalcorrgfe: 0.140504 hartree
zpe.sumelectzpe: -838.671466 hartree
zpe.sumelectthermal: -838.660652 hartree
zpe.sumelectthermalent: -838.659708 hartree
zpe.sumelectthermalfe: -838.707605 hartree
dipole: -5.7189 1.4883 -0.0919
dipole: 5.9101
quadrupole: -72.1887 -71.2708 -75.7882
quadrupole: 0.4854 1.1885 0.0315
quadrupole: 0.8939 1.8118 -2.7057 0.4854 1.1885 0.0315
hfenergy: -838.8481095 hartree
pointgroup: C01 [X(C8H11N1O1S1)]
dipole: -1.8773751 -1.37147 0.0326448 debye
dipolederiv: -0.4508655 -0.0675223 -0.0039541 -0.1443829 -0.944512 -0.0540964 -0.0079072 -0.055583 -0.2841302 -1.1591708 -0.362062 0.0429522 -0.1953878 -0.4392431 0.0236746 0.0731321 0.0380327 -0.3751949 -0.4278485 -0.2559267 -0.0214614 0.2282363 -0.4042483 -0.0128514 0.0710965 0.0507418 -0.0852812 0.392016 -0.0731523 0.0169521 -0.2372257 0.1659702 -0.0311202 -0.0907676 -0.046551 0.1783912 0.2488452 0.2710145 -0.0191495 -0.3243493 0.0563487 0.0117052 -0.1049557 -0.0538181 0.003793 -0.0619211 -0.0165986 0.0083647 0.4914146 1.2537164 0.0864633 0.0484373 0.1075854 -0.1218219 -0.2302067 -0.4298695 -0.0455431 0.1997769 -0.0077685 0.0024986 0.0227597 0.0665871 -0.1919306 -0.0433116 0.0218067 -0.0165466 0.0254534 0.0615203 0.0441869 0.0289914 0.0723892 -0.0525351 0.9791053 0.6623553 -0.0261244 0.3383336 -0.4005165 -0.0833744 -0.0623648 -0.1249894 0.1151963 -0.0653952 -0.0805745 0.0054334 -0.0054786 0.0247737 0.0080132 0.0494869 0.0319083 0.0775821 0.1172029 0.3062011 -0.0025265 -0.2661937 0.2604232 0.0737121 -0.0528286 0.0031541 -0.1218394 -0.0587008 -0.0158142 0.0647358 -0.0736499 0.0348499 0.1196353 0.0420249 0.0745946 0.0118861 0.1078438 -0.0573755 -0.093319 0.074117 0.0131889 -0.0663577 -0.0352697 -0.0048865 0.0296072 0.0814692 -0.067613 0.0009872 -0.0405785 -0.0718626 -0.0154563 0.0057884 -0.0161376 0.1636203 0.0520662 -0.1047755 0.0924413 -0.0444096 0.0511214 0.0560747 0.0527268 -0.0003215 0.0484494 0.0709727 -0.0214242 -0.0538414 -0.0811323 -0.0510738 -0.1223527 -0.0445016 -0.0666116 -0.0001199 -0.0806639 0.128364 0.0148695 0.145612 0.0112553 -0.0174074 0.0151185 -0.0306905 0.0740931 -0.0216301 -0.0405603 0.06148 -0.0107931 0.095035 -0.0574426 0.1119787 -0.0082714 -0.0735676 0.0983206 0.072632 0.0131704 -0.0394005 -0.1196388 -0.0342558 -0.0044642 -0.0535308 0.110775 -0.0656917 0.00968 -0.058043 0.0635981 0.0744438 0.0793524 -0.1056343 0.0444733 0.0125365 -0.0017886 0.0650641 0.0261449 0.066911 0.0516407 -0.0185287 0.025611 -0.020734 0.1618013 0.5193523 0.056151 -0.0070226 -0.170471 0.2845759 0.0079274 -0.0384584 -0.007341 0.3186891 unknown
polarizability: 136.2111379|11.4659941|156.2383825|-4.0068898|4.5367921|60.9220103 unknown
InChI: InChI=1S/C8H11NOS/c1-3-9-6(2)4-5-7(10)8(9)11/h4-5,10H,3H2,1-2H3
charge 0 multiplicity 1
22 atoms
S  0.878249 2.478518 0.24097
O  2.967286 0.423138 -0.181514
N  -0.684231 0.16292 0.231023
C  -1.851199 1.075958 0.435091
C  -0.886331 -1.221596 0.118869
C  0.583961 0.756245 0.124374
C  0.218419 -2.047602 -0.096907
C  -2.400261 1.62021 -0.898643
C  1.710355 -0.133989 -0.088617
C  -2.283453 -1.786579 0.251622
C  1.531516 -1.513041 -0.201009
H  -2.626348 0.53124 0.995469
H  -1.489867 1.914607 1.055061
H  0.055871 -3.124563 -0.182916
H  -1.621633 2.199598 -1.421662
H  -2.746901 0.808505 -1.5628
H  -3.253661 2.292891 -0.699724
H  -2.68939 -1.667813 1.274564
H  -2.255131 -2.866002 0.032896
H  -3.000152 -1.320848 -0.448639
H  2.399112 -2.156311 -0.368598
H  2.838988 1.427213 -0.069512
