program: Gaussian 09
title: 000141046
version: EM64L-G09RevD.01
frameworkgroup: C1[X(C12H26O4)]
method: RPBEPBE
basis: SDD
operation: Freq
keyword: #pfreq=noraman
keyword: PBEPBE/SDD
title: #p freq=noraman PBEPBE/SDD
converged: YES YES NO NO
title: Mulliken charges:
elementType: O O O O C C C C C C C C C C C C H H H H H H H H H H H H H H H H H H H H H H H H H H
charge: -0.295267 -0.212252 -0.196297 -0.401726 0.377745 -0.476341 -0.483602 0.339866 -0.716899 -0.717626 -0.738830 -0.723638 0.314647 -0.689854 -0.707976 -0.690606 0.215929 0.244939 0.213355 0.234404 0.239457 0.205615 0.230302 0.243088 0.226952 0.201121 0.239656 0.207571 0.241674 0.222459 0.197164 0.248344 0.226072 0.202897 0.246518 0.228457 0.233479 0.211547 0.241972 0.208344 0.217572 0.389767
chargesum: 0.00000
title: Mulliken charges with hydrogens summed into heavy atoms:
elementType: O O O O C C C C C C C C C C C C
charge: -0.295267 -0.212252 -0.196297 -0.011959 0.377745 -0.015472 -0.035843 0.339866 -0.041526 -0.046465 -0.049929 -0.055671 0.314647 -0.014367 -0.034493 -0.022717
polarizability: 1.90008743e+02 -8.02446637e+00 1.50547474e+02 -2.66132629e-01 -1.50819302e+00 1.27666748e+02
1716.lowfreq: -16.8922 -11.0196 0.0009 0.0010 0.0011 6.9791 15.8586 35.8054 43.8600
frequency: 7.5221 35.7066 43.8278 66.2061 96.2809 118.8662 129.0311 148.6815 153.5793 171.2069 181.0987 197.5883 202.9327 205.9103 210.9044 215.2927 218.7429 233.8969 252.7786 283.2480 306.5293 322.3230 328.3662 343.9370 352.7435 387.6206 400.7485 414.3204 435.7230 464.0527 479.0970 487.3731 516.1157 541.2525 604.5707 712.9157 718.5371 750.6169 789.8354 802.2014 811.2253 826.6354 838.2615 858.3784 909.9618 915.6174 919.5836 921.6212 928.7943 942.5056 953.1888 985.9032 1000.2291 1010.5509 1022.6452 1027.2043 1057.9283 1101.6521 1155.4385 1174.0555 1182.4070 1201.0535 1226.1121 1231.8797 1249.4398 1254.8213 1274.4867 1299.7922 1308.7378 1359.1596 1369.6493 1371.7910 1375.0419 1380.3586 1385.4769 1388.7174 1389.5688 1409.3765 1443.8314 1446.5917 1447.3019 1456.4723 1462.5816 1463.5159 1464.9095 1465.6404 1468.3810 1469.9545 1471.0504 1472.2569 1481.4618 1488.8782 1491.3229 1496.0852 2986.2996 2986.4719 2986.5334 2989.4272 2990.2147 2991.3693 2993.7795 2995.3492 2998.6048 3042.0347 3059.9056 3082.3372 3083.1484 3085.1001 3086.1409 3090.9335 3091.1336 3093.2205 3095.5327 3097.1630 3098.7815 3100.9230 3101.1880 3103.4929 3107.4742 3168.1085
redmass: 3.4789 3.3681 3.5640 3.7906 2.4675 2.6170 1.5505 1.1271 1.3689 1.6917 2.1205 1.4504 1.8151 2.8503 1.0900 1.1852 2.2791 1.2448 3.2362 2.0176 3.3244 2.7144 2.6297 2.6987 2.5141 2.5546 2.5194 2.4281 2.9369 2.9181 2.6061 3.4533 3.3212 3.0871 1.1042 3.6758 4.8754 3.6838 1.8531 4.7612 4.0301 3.6425 10.4617 3.7513 1.6163 1.6926 1.5725 1.5104 1.5108 1.6759 1.2013 1.3873 1.4651 1.4661 1.4072 1.4624 2.4650 1.5082 2.1346 2.2180 2.1009 2.6338 1.9316 1.9628 2.9962 2.9345 2.7469 1.6426 1.4316 1.4403 1.2070 1.2188 1.2370 1.2119 1.1512 1.2025 1.2141 1.1537 1.0597 1.0517 1.0550 1.0578 1.0735 1.0539 1.0502 1.0595 1.0576 1.0551 1.0566 1.0539 1.0607 1.0517 1.0530 1.0545 1.0552 1.0362 1.0367 1.0352 1.0378 1.0369 1.0355 1.0383 1.0576 1.1001 1.1014 1.0992 1.0990 1.0990 1.0994 1.0989 1.0988 1.1011 1.0999 1.0990 1.1002 1.1001 1.0997 1.1001 1.0992 1.0712
irintensity: 2.8224 0.1651 0.7101 0.1819 0.6712 0.5297 0.5949 0.2350 2.0679 1.5955 1.1582 0.5128 0.1756 1.0775 0.1727 0.0339 0.7419 0.4492 0.7673 1.0627 3.6216 6.3486 3.2316 0.1309 5.4280 3.7098 0.4656 4.7103 1.8011 3.5403 3.2810 4.2403 2.4981 5.6316 96.5643 10.9198 6.7400 1.4047 14.7512 3.2333 9.3297 7.9604 3.2993 3.2184 0.5527 3.5661 1.3741 0.7957 1.3860 3.3097 0.0399 2.4989 10.7613 0.5946 0.7681 0.9361 2.0568 43.4355 24.9015 18.2216 106.3251 2.2049 39.8865 33.6445 31.1611 11.5693 13.7583 30.7432 5.6500 0.4673 9.4722 34.7673 35.9013 50.7285 86.9663 13.1547 21.7881 6.5533 2.2145 1.4141 0.4885 1.2944 8.7236 4.8724 3.0960 9.9228 6.1028 4.1320 5.0648 1.3411 13.1635 12.2896 19.5026 17.9080 2.0435 4.4959 37.8612 12.4477 23.2895 31.4269 25.9469 17.0771 30.3950 5.4415 19.9794 2.3983 11.7362 15.1014 33.2226 21.4784 49.6038 2.8303 24.9699 41.5614 31.5741 31.7597 29.5488 7.4511 29.8608 298.3392
temp: 298.150 k
press: 1.00000 atm
elementType: 8 8 8 8 6 6 6 6 6 6 6 6 6 6 6 6 1 1 1 1 1 1 1 1 1 1 1 1 1 1 1 1 1 1 1 1 1 1 1 1 1 1
symmnumber: 1
zpe: 953102.7 jmol-1
zpe.correction: 0.363018 hartree
zpe.thermalcorrener: 0.384667 hartree
zpe.thermalcorrenthalpy: 0.385612 hartree
zpe.thermalcorrgfe: 0.312603 hartree
zpe.sumelectzpe: -772.278470 hartree
zpe.sumelectthermal: -772.256820 hartree
zpe.sumelectthermalent: -772.255876 hartree
zpe.sumelectthermalfe: -772.328885 hartree
dipole: 0.8362 2.4757 2.1708
dipole: 3.3972
quadrupole: -90.2663 -101.2637 -102.1476
quadrupole: -8.6835 -2.7415 -2.7135
quadrupole: 7.6262 -3.3712 -4.2550 -8.6835 -2.7415 -2.7135
hfenergy: -772.6414875 hartree
pointgroup: C01 [X(C12H26O4)]
dipole: 0.4262244 0.9513302 0.8364679 debye
polarizability: 188.609262|-10.7166168|151.8327522|-2.5624391|-1.1628197|127.7809511 unknown
InChI: InChI=1S/C12H26O4/c1-10(2,3)15-16-12(6,7)9-8-11(4,5)14-13/h13H,8-9H2,1-7H3
charge 0 multiplicity 1
42 atoms
O  0.857227 0.380381 -0.35456
O  -2.220231 -0.986824 -0.980495
O  2.406075 0.375435 -0.285636
O  -0.947683 -1.706137 -0.550375
C  0.392918 1.774167 -0.032815
C  -1.150303 1.616371 -0.157162
C  -1.813395 0.651972 0.864031
C  -2.839224 -0.327127 0.226586
C  0.853843 2.183188 1.379667
C  0.928803 2.74053 -1.108533
C  -4.043968 0.392155 -0.414416
C  -3.276968 -1.405919 1.232861
C  2.865451 -1.03536 -0.060752
C  2.533633 -1.911581 -1.28713
C  4.38935 -0.795119 0.058272
C  2.277101 -1.605293 1.245268
H  -1.581203 2.632391 -0.080044
H  -1.360552 1.256349 -1.183459
H  -2.327229 1.216505 1.664327
H  -1.04047 0.0360 1.359015
H  1.954113 2.234599 1.423027
H  0.444034 3.17836 1.631954
H  0.510453 1.462014 2.140344
H  2.031326 2.743447 -1.106875
H  0.583114 2.433421 -2.110963
H  0.574125 3.768808 -0.911866
H  -4.663274 -0.329587 -0.974733
H  -4.667006 0.846007 0.377174
H  -3.723074 1.185409 -1.110803
H  -4.063652 -2.045368 0.796114
H  -3.66812 -0.946899 2.159879
H  -2.413855 -2.044311 1.487667
H  2.89004 -1.423547 -2.210927
H  3.0315 -2.894365 -1.194497
H  1.449986 -2.094399 -1.384481
H  4.619368 -0.142633 0.918154
H  4.784784 -0.325899 -0.859171
H  4.898799 -1.764013 0.204206
H  1.182109 -1.719109 1.171577
H  2.712011 -2.60068 1.449458
H  2.507542 -0.940177 2.096317
H  -0.2589 -0.964765 -0.639807
