program: Gaussian 09
title: 000141038
version: EM64L-G09RevD.01
frameworkgroup: C1[X(C12H21NO)]
method: RPBEPBE
basis: SDD
operation: Freq
keyword: #p
keyword: freq=noraman
keyword: PBEPBE/SDD
title: #p freq=noraman PBEPBE/SDD
converged: YES YES NO NO
title: Mulliken charges:
elementType: O N C C C C C C C C C C C C H H H H H H H H H H H H H H H H H H H H H
charge: -0.165360 0.018569 0.117332 0.096902 -0.031938 0.068439 -0.707514 -0.707067 -0.700289 -0.701326 -0.456792 -0.348046 -0.330384 -0.691770 0.213631 0.231284 0.235149 0.214212 0.230445 0.235226 0.222278 0.235975 0.219282 0.222029 0.236611 0.215373 0.179517 0.224145 0.187739 0.208395 0.213078 0.181512 0.212204 0.205941 0.215221
chargesum: 0.00000
title: Mulliken charges with hydrogens summed into heavy atoms:
elementType: O N C C C C C C C C C C C C
charge: -0.165360 0.018569 0.117332 0.096902 -0.031938 0.068439 -0.027451 -0.027184 -0.022754 -0.027313 -0.053131 0.048089 0.064205 -0.058405
polarizability: 1.60656106e+02 -1.03587077e+00 1.31518532e+02 -8.01246188e+00 -7.66961294e-01 1.20811540e+02
1716.lowfreq: -16.4350 -8.4379 -0.0009 -0.0007 -0.0004 7.1749 24.5663 40.3645 50.7697
frequency: 24.1536 40.0379 50.7365 78.4502 113.6666 128.4073 149.4769 156.6177 167.4049 169.7005 186.9270 191.8562 193.7812 225.7049 236.8963 249.3406 256.5828 268.7216 281.7902 316.8911 339.5665 406.6800 484.1350 567.7182 609.2234 644.0428 656.1399 726.4383 734.4272 746.5777 817.6192 828.2675 846.7222 914.2611 941.4095 945.8099 950.5768 960.3778 966.0022 974.2277 1007.6625 1026.5056 1037.8498 1074.3424 1075.7362 1117.1185 1135.9860 1155.6549 1181.2450 1184.3610 1219.6125 1234.4840 1239.2202 1254.6589 1288.6108 1300.3641 1339.9165 1357.2769 1365.1634 1370.5433 1386.6011 1388.9433 1389.4643 1449.5866 1453.2699 1458.3704 1459.1544 1463.1856 1465.7363 1471.2614 1472.9135 1477.2121 1477.3964 1480.0433 1483.2537 1485.3304 1668.0705 1753.8295 2927.0959 2962.5592 2971.7350 2977.2214 2977.5425 2979.1469 2981.4828 2982.7133 3010.5312 3014.0074 3044.6505 3069.1119 3071.9563 3075.8219 3078.0570 3079.6966 3080.7629 3082.5165 3084.6047 3087.6105 3091.5670
redmass: 3.5819 3.5716 3.4825 1.6070 2.9029 2.8371 1.9086 2.1195 1.3248 1.4353 1.5135 2.1415 1.2196 1.1779 2.0190 2.5321 2.0656 2.8244 2.4696 2.5052 3.4629 3.0245 2.8164 3.4503 3.7347 4.5446 3.0998 1.8875 5.1142 1.4338 3.7425 2.1141 1.5298 4.1737 2.1163 1.4055 1.3965 1.3892 1.8640 1.2653 1.3712 2.8008 2.2332 2.7848 2.8683 2.1242 1.8835 2.2150 2.4000 5.2860 1.3143 3.1336 1.3431 3.5134 1.1172 1.2928 1.3052 1.5583 1.1760 1.1736 1.1901 1.2013 1.2136 1.0787 1.0611 1.0598 1.0515 1.0573 1.0569 1.0615 1.0622 1.0466 1.0603 1.0507 1.0557 1.0734 11.4620 11.8229 1.0628 1.0606 1.0373 1.0441 1.0510 1.0343 1.0337 1.0342 1.0951 1.0960 1.1028 1.1008 1.0994 1.1007 1.1006 1.0998 1.1003 1.0998 1.0996 1.1014 1.1004
irintensity: 0.1968 1.5700 2.0201 0.1029 1.1932 0.8241 0.0264 0.8542 0.0528 1.1443 1.6085 2.3505 0.6268 0.1885 0.3261 1.3619 2.3741 2.0305 0.1186 4.7630 4.1187 1.8692 4.1918 0.2319 1.5276 0.4958 1.2941 2.9194 1.0107 10.2666 0.8757 1.7360 3.7706 10.2209 8.0526 0.5039 2.5825 9.1496 2.8889 0.5327 0.1326 47.8387 39.0533 1.5525 0.5335 3.2811 3.0425 7.8926 24.3903 6.1363 3.3534 16.8357 3.1703 17.0927 0.0345 0.8239 14.4815 2.3584 1.9961 23.5744 2.7064 20.1796 8.9562 7.0864 0.2365 12.3983 2.0367 5.3579 14.2286 25.7849 10.3713 11.7222 1.2875 0.3032 29.6186 4.9235 271.4185 14.7505 48.5540 33.6427 28.4193 40.2732 48.5231 33.4750 32.6660 10.4873 28.4948 20.6245 25.0394 79.5505 46.9753 0.6529 1.2179 48.9347 40.1329 71.0229 1.2344 0.9341 38.0174
temp: 298.150 k
press: 1.00000 atm
elementType: 8 7 6 6 6 6 6 6 6 6 6 6 6 6 1 1 1 1 1 1 1 1 1 1 1 1 1 1 1 1 1 1 1 1 1
symmnumber: 1
zpe: 794486.0 jmol-1
zpe.correction: 0.302604 hartree
zpe.thermalcorrener: 0.320511 hartree
zpe.thermalcorrenthalpy: 0.321455 hartree
zpe.thermalcorrgfe: 0.256590 hartree
zpe.sumelectzpe: -598.694658 hartree
zpe.sumelectthermal: -598.676751 hartree
zpe.sumelectthermalent: -598.675807 hartree
zpe.sumelectthermalfe: -598.740672 hartree
dipole: -2.1742 0.9106 0.8668
dipole: 2.5115
quadrupole: -97.4946 -83.5434 -87.6978
quadrupole: -4.0846 5.7387 2.6673
quadrupole: -7.9160 6.0352 1.8808 -4.0846 5.7387 2.6673
hfenergy: -598.9972619 hartree
pointgroup: C01 [X(C12H21N1O1)]
dipole: 0.8576266 -0.3969455 0.2885888 debye
polarizability: 160.9009077|-2.0247933|131.2982983|7.1542945|1.7682177|120.7869725 unknown
InChI: InChI=1S/C12H21NO/c1-6-7-8-13-9-11(2,3)10(14)12(9,4)5/h6-8H2,1-5H3
charge 0 multiplicity 1
35 atoms
O  -3.281763 -0.240213 -1.115169
N  0.76686 0.382502 1.101641
C  -1.499968 1.105291 0.173646
C  -1.019776 -1.092052 -0.229762
C  -0.331592 0.130734 0.474861
C  -2.193349 -0.098827 -0.527177
C  -1.131231 2.265752 -0.781907
C  -2.243114 1.629451 1.425349
C  -1.447361 -2.256569 0.697913
C  -0.345704 -1.620325 -1.52057
C  1.794623 -0.665854 1.305176
C  3.181976 -0.149281 0.857619
C  3.290918 0.077788 -0.666223
C  4.685473 0.582746 -1.093463
H  -0.621169 1.904206 -1.693045
H  -2.041363 2.811453 -1.088792
H  -0.450126 2.962583 -0.261711
H  -2.537413 0.809793 2.105332
H  -3.156226 2.17484 1.126847
H  -1.578944 2.313961 1.982534
H  -1.909763 -1.891226 1.632318
H  -2.185132 -2.893246 0.175931
H  -0.575557 -2.880219 0.96735
H  0.021173 -0.798499 -2.161054
H  -1.078446 -2.209751 -2.102045
H  0.512369 -2.272722 -1.277097
H  1.562876 -1.6211 0.782647
H  1.831624 -0.876661 2.392613
H  3.952112 -0.878888 1.181311
H  3.387738 0.800769 1.388396
H  2.518821 0.809369 -0.976016
H  3.060488 -0.870538 -1.195504
H  4.924602 1.544113 -0.600965
H  5.47432 -0.141576 -0.814494
H  4.742326 0.739898 -2.18629
