program: Gaussian 09
title: 000011245
version: EM64L-G09RevD.01
frameworkgroup: C1[X(C3H4Cl2)]
method: RPBEPBE
basis: SDD
operation: Freq
keyword: #pfreq=noraman
keyword: PBEPBE/SDD
title: #p freq=noraman PBEPBE/SDD
converged: NO NO NO NO
title: Mulliken charges:
elementType: Cl Cl C C C H H H H
charge: 0.018538 -0.002288 -0.700540 0.048142 -0.319592 0.237005 0.236996 0.240223 0.241517
chargesum: 0.00000
title: Mulliken charges with hydrogens summed into heavy atoms:
elementType: Cl Cl C C C
charge: 0.018538 -0.002288 0.013683 0.289659 -0.319592
polarizability: 6.72738335e+01 2.77806556e+00 5.74164788e+01 1.00150695e-03 1.46407936e-03 2.47331111e+01
1716.lowfreq: -0.0009 0.0011 0.0028 4.7768 9.5933 14.3236 147.0082 207.8034 210.4676
frequency: 146.9174 207.8032 210.4582 270.1627 416.3637 434.6299 544.7136 803.6259 814.1976 971.1271 1038.8483 1109.7515 1269.9839 1396.9842 1463.2323 1468.3751 1659.4765 2972.8104 3047.3748 3099.9083 3127.0804
redmass: 1.0329 4.2913 3.0648 15.7757 6.0459 5.3530 5.5629 4.8050 1.1472 1.9856 1.4616 2.4924 1.2205 1.2224 1.0634 1.0461 7.4049 1.0375 1.0975 1.0968 1.0910
irintensity: 0.3861 0.8649 1.6445 0.2754 9.5067 3.5893 9.5428 158.1842 32.2472 43.1633 0.4565 13.5612 21.6870 9.7006 12.8852 16.4000 35.5249 22.4595 18.9378 7.8626 8.5514
temp: 298.150 k
press: 1.00000 atm
elementType: 17 17 6 6 6 1 1 1 1
symmnumber: 1
zpe: 158348.6 jmol-1
zpe.correction: 0.060312 hartree
zpe.thermalcorrener: 0.066392 hartree
zpe.thermalcorrenthalpy: 0.067336 hartree
zpe.thermalcorrgfe: 0.029738 hartree
zpe.sumelectzpe: -1036.414010 hartree
zpe.sumelectthermal: -1036.407930 hartree
zpe.sumelectthermalent: -1036.406986 hartree
zpe.sumelectthermalfe: -1036.444584 hartree
dipole: -2.0031 -1.3810 0.0000
dipole: 2.4330
quadrupole: -41.1230 -41.8126 -44.8383
quadrupole: 1.6624 -0.0003 0.0001
quadrupole: 1.4683 0.7787 -2.2470 1.6624 -0.0003 0.0001
hfenergy: -1036.4743216 hartree
pointgroup: C01 [X(C3H4Cl2)]
dipole: 0.8852548 -0.364153 0.0000543 debye
dipolederiv: -0.6712149 -0.2401562 -0.0002434 -0.3017049 -0.3320358 -0.0001856 -0.0002007 -0.000155 0.0043969 -0.1844864 -0.0282222 -0.0000501 0.026117 -0.7592166 -0.0002702 -0.0000129 -0.0003018 0.0042597 -0.1244876 -0.0584073 -0.0000458 0.0672444 0.0003378 -0.0000006 0.0000743 -0.0000672 0.0863635 -0.0807551 -0.0130839 -0.0000057 0.1190244 -0.2573437 -0.0000331 -0.0000789 0.0000047 -0.1552335 0.953613 0.2395434 0.0003502 0.2336943 1.2925571 0.0005729 0.0002838 0.0005437 -0.1643101 -0.0204374 0.0274006 0.0856552 -0.0107658 0.0994639 -0.0787272 0.1193787 -0.0693408 -0.0330163 -0.0203748 0.0274271 -0.0856503 -0.0106809 0.0993599 0.0788054 -0.1193965 0.0694316 -0.0329735 0.0987648 0.0444357 0.000012 -0.058436 -0.0879905 -0.0000841 -0.0000265 -0.0000553 0.12023 0.0493783 0.0010627 -0.000022 -0.0644924 -0.0551321 -0.0000775 -0.0000212 -0.00006 0.1702831 unknown
polarizability: 67.9816703|-0.4890734|56.7086366|0.0100605|0.009815|24.7331165 unknown
InChI: InChI=1S/C3H4Cl2/c1-2-3(4)5/h2H,1H3
charge 0 multiplicity 1
9 atoms
Cl -2.024436 -0.860105 -0.00068
Cl -0.507631 1.768625 0.000586
C  2.142703 -0.141866 0.000395
C  0.751862 -0.726133 0.000083
C  -0.409687 -0.036585 -0.000074
H  2.703573 -0.485797 -0.8904
H  2.7034 -0.486395 0.891074
H  2.130987 0.960392 0.000752
H  0.666929 -1.821436 -0.000235
