program: Gaussian 09
title: 000140999
version: EM64L-G09RevD.01
frameworkgroup: C1[X(C5H11N)]
method: RPBEPBE
basis: SDD
operation: Freq
keyword: #pfreq=noraman
keyword: PBEPBE/SDD
title: #p freq=noraman PBEPBE/SDD
converged: YES YES NO NO
title: Mulliken charges:
elementType: N C C C C C H H H H H H H H H H H
charge: -0.152027 0.370170 -0.514977 -0.725717 -0.725449 -0.634038 0.207950 0.230194 0.211003 0.237819 0.201256 0.221314 0.209414 0.216601 0.234621 0.182208 0.229658
chargesum: 0.00000
title: Mulliken charges with hydrogens summed into heavy atoms:
elementType: N C C C C C
charge: -0.152027 0.370170 -0.076833 -0.075638 -0.078120 0.012449
polarizability: 6.72852731e+01 -1.36157890e+00 5.78297322e+01 4.19092538e-01 -2.78808614e+00 5.62827799e+01
1716.lowfreq: -0.0007 -0.0005 -0.0003 6.7648 20.5182 27.5675 149.1052 161.3219 186.3751
frequency: 149.0622 161.2589 186.3544 223.8430 273.2230 348.8181 385.3239 428.1597 451.1127 653.9924 672.3002 842.9711 895.7428 940.7926 980.3793 997.7262 1033.9177 1091.7743 1105.3422 1117.7537 1136.1242 1165.4024 1278.8626 1346.5144 1383.5227 1394.1455 1420.6100 1455.7925 1458.1034 1463.4046 1468.5006 1480.3818 1481.9225 1488.0517 2908.4159 2972.9583 2977.1510 3027.2962 3037.5411 3058.5101 3063.5843 3074.3070 3083.2435 3096.1787 3147.3784
redmass: 1.0323 1.1832 1.2418 1.8301 1.9046 2.2351 2.3859 2.2771 2.4971 4.0710 3.9661 3.7886 1.2749 1.3222 1.6435 1.2985 1.3799 1.3122 1.4855 1.7188 1.6502 2.8267 3.1715 3.3237 1.2955 1.2413 1.1400 1.0482 1.0600 1.0627 1.0489 1.1823 1.0529 1.0592 1.0480 1.0366 1.0366 1.0810 1.0565 1.0990 1.0982 1.1010 1.0983 1.0987 1.1137
irintensity: 0.0826 0.3440 0.8756 2.4692 0.9355 0.8143 1.6234 2.5570 5.5934 3.9657 8.1438 1.4101 1.2415 0.9661 11.0211 1.1798 2.0892 3.9842 1.9346 13.4346 11.1156 21.5040 7.7354 27.4777 31.9648 8.6212 2.5433 8.3724 9.0153 1.8873 8.9655 6.4129 7.4015 20.7141 94.5603 29.4768 40.6375 51.3781 33.9553 0.7849 60.8988 35.7945 33.8038 24.9280 30.7373
temp: 298.150 k
press: 1.00000 atm
elementType: 7 6 6 6 6 6 1 1 1 1 1 1 1 1 1 1 1
symmnumber: 1
zpe: 393617.8 jmol-1
zpe.correction: 0.149921 hartree
zpe.thermalcorrener: 0.157548 hartree
zpe.thermalcorrenthalpy: 0.158492 hartree
zpe.thermalcorrgfe: 0.119260 hartree
zpe.sumelectzpe: -251.322610 hartree
zpe.sumelectthermal: -251.314984 hartree
zpe.sumelectthermalent: -251.314040 hartree
zpe.sumelectthermalfe: -251.353271 hartree
dipole: -0.0675 1.4079 0.8475
dipole: 1.6447
quadrupole: -36.9069 -39.7047 -38.7205
quadrupole: 1.2724 0.5120 -1.6928
quadrupole: 1.5371 -1.2607 -0.2765 1.2724 0.5120 -1.6928
hfenergy: -251.4725314 hartree
pointgroup: C01 [X(C5H11N1)]
dipole: -0.0285269 -0.5296236 -0.3706371 debye
dipolederiv: -0.5929843 0.1144163 -0.1829199 0.0776309 -0.3072693 -0.1290887 -0.3032067 -0.0946416 -0.3577443 0.3826208 -0.0391427 -0.0132416 -0.0449626 0.2024226 0.0677685 0.0145754 0.0841319 0.2611125 -0.0070295 -0.0947933 0.0694231 -0.0794413 0.1481833 0.0636052 0.0807091 0.0664154 0.0462309 -0.0216726 0.055007 0.0425731 0.0282234 -0.0551897 -0.0498292 0.0600604 -0.059353 0.0518982 -0.0388445 -0.0061328 0.018835 0.0301418 -0.084319 -0.0791945 -0.0139164 -0.0900287 0.0429415 0.3367707 -0.0899033 0.0781501 -0.1555696 0.225276 0.01987 0.0928346 0.0468814 0.2004648 0.0281574 0.0818442 0.0949485 0.0683174 0.013948 -0.1166827 0.0547824 -0.0229046 -0.1115503 0.0699399 0.0546715 -0.0182797 0.0688585 -0.1246523 0.1011342 -0.0181099 0.0440276 0.0153023 0.0376136 -0.0080923 0.0398145 -0.0322959 0.0285951 0.1331367 0.0952578 0.1007179 -0.1011323 0.09431 -0.0496173 -0.0039509 0.0032741 -0.1225183 -0.0605676 0.0097457 -0.0332806 0.0869646 -0.1360582 -0.0038443 -0.0842673 -0.0179835 0.0961995 -0.0247518 -0.1338872 -0.0111562 -0.0138922 -0.0900373 -0.0752783 -0.1193226 -0.0544063 0.049138 -0.0055482 -0.1190297 -0.039834 0.029164 -0.0550445 0.1081296 0.1169612 0.0527631 0.034349 -0.0289337 0.1074463 -0.0485191 0.0340779 0.0958319 -0.0203313 0.0147563 -0.040287 -0.0179009 0.0819653 0.03124 0.1422318 -0.0979725 -0.1510592 -0.0888603 -0.0284662 -0.1277185 0.0023333 0.0047357 0.0134737 -0.0043417 0.1019624 -0.0177235 0.0601866 -0.0295114 0.1553492 -0.1176537 -0.1025092 0.0655774 -0.1893096 -0.0799683 0.0652093 0.0017405 0.0044979 0.0681064 0.0290583 0.12489 -0.037553 0.1089632 -0.1078594 unknown
polarizability: 67.3150505|1.3235647|58.1766855|-0.2593478|-2.6434702|55.9060492 unknown
InChI: InChI=1S/C5H11N/c1-5(2)4-6(5)3/h4H2,1-3H3
charge 0 multiplicity 1
17 atoms
N  0.749924 0.549554 0.34693
C  -0.561994 -0.079183 -0.101737
C  0.243402 0.802882 -1.053372
C  -1.781593 0.51013 0.597903
C  -0.662753 -1.575745 -0.394743
C  1.969104 -0.281331 0.490229
H  0.757298 0.295699 -1.885093
H  -0.072684 1.829913 -1.269488
H  -1.993323 -0.031577 1.539472
H  -1.602626 1.568873 0.849414
H  -2.678722 0.443367 -0.046647
H  -1.563723 -1.778094 -1.003575
H  0.207724 -1.961473 -0.953075
H  -0.755181 -2.156124 0.543223
H  2.845265 0.391841 0.469915
H  2.118018 -1.055656 -0.296942
H  1.946364 -0.785576 1.473185
