program: Gaussian 09
title: 000140995
version: EM64L-G09RevD.01
frameworkgroup: C1[X(C9H11NO)]
method: RPBEPBE
basis: SDD
operation: Freq
keyword: #p
keyword: freq=noraman
keyword: PBEPBE/SDD
title: #p freq=noraman PBEPBE/SDD
converged: YES YES NO NO
title: Mulliken charges:
elementType: O N C C C C C C C C C H H H H H H H H H H H
charge: -0.270105 -0.309219 -0.538766 0.467662 -0.377516 -0.427588 -0.395927 -0.225171 -0.223784 -0.240035 -0.048488 0.217345 0.225883 0.263426 0.226321 0.246090 0.234316 0.320563 0.228384 0.227460 0.230989 0.168160
chargesum: 0.00000
title: Mulliken charges with hydrogens summed into heavy atoms:
elementType: O N C C C C C C C C C
charge: -0.270105 0.011344 -0.095538 0.467662 0.112231 -0.181498 -0.161611 0.003213 0.003676 -0.009046 0.119672
polarizability: 1.34761077e+02 -5.12246486e+00 1.03394844e+02 -1.95609509e+01 -5.07579892e+00 6.75486801e+01
1716.lowfreq: -5.3278 -0.0006 -0.0006 -0.0005 5.5326 18.7612 25.9724 46.9589 54.4092
frequency: 25.5619 46.9247 54.4043 121.8283 205.4996 246.4338 318.2597 350.9700 404.9836 446.7975 492.0294 573.2954 603.0221 617.8653 706.0082 711.5335 755.7648 779.0076 826.3974 858.4125 921.1931 963.6763 972.2946 979.4822 989.2401 992.9494 997.3423 1027.6635 1045.7720 1088.8360 1168.4336 1173.8215 1187.6480 1194.7829 1211.8648 1243.4875 1313.8198 1329.9011 1352.6622 1367.2445 1381.5008 1439.8271 1461.2602 1467.9690 1479.5649 1484.7287 1591.6589 1612.9297 1640.6695 2930.4501 2991.4688 2995.9545 3060.1768 3079.4319 3115.2854 3118.6343 3133.8454 3145.1922 3163.8155 3531.5299
redmass: 5.7038 4.3503 4.2668 3.8016 3.6523 3.5798 2.5133 2.2308 2.8336 3.0408 4.0834 2.7735 1.1630 5.8155 2.1275 2.7423 1.8723 3.4369 2.2735 1.2464 1.4178 1.6903 2.3678 1.4156 5.0195 2.0160 1.3785 2.1336 2.5402 1.6081 1.3573 1.1009 1.1175 1.4928 2.3809 1.3930 1.3564 1.2695 1.3270 1.2124 7.4264 2.1480 1.1206 1.1275 1.7695 2.1104 6.0018 6.1239 5.6426 1.0865 1.0650 1.0612 1.1004 1.0994 1.0874 1.0869 1.0907 1.0958 1.1015 1.0780
irintensity: 7.3264 3.1887 4.1169 5.2494 17.2398 18.7179 15.5092 0.5953 0.0132 4.8851 10.0995 16.3227 124.9547 2.5092 27.1227 18.8977 35.2571 9.7934 13.5851 0.1912 2.0681 0.2432 6.8562 0.7264 0.2452 8.6976 1.2142 4.0019 10.0833 12.3489 29.5315 6.9409 0.4687 3.9071 0.7336 48.2708 8.5491 2.9308 12.8218 15.8148 0.5297 6.6903 39.0447 14.5368 160.6765 14.2403 1.3399 12.5160 307.5393 107.3868 27.8327 28.3277 20.7923 7.4419 8.4675 6.6393 9.4573 40.6795 20.5823 22.0314
temp: 298.150 k
press: 1.00000 atm
elementType: 8 7 6 6 6 6 6 6 6 6 6 1 1 1 1 1 1 1 1 1 1 1
symmnumber: 1
zpe: 475473.8 jmol-1
zpe.correction: 0.181098 hartree
zpe.thermalcorrener: 0.191357 hartree
zpe.thermalcorrenthalpy: 0.192302 hartree
zpe.thermalcorrgfe: 0.143277 hartree
zpe.sumelectzpe: -478.727383 hartree
zpe.sumelectthermal: -478.717124 hartree
zpe.sumelectthermalent: -478.716180 hartree
zpe.sumelectthermalfe: -478.765205 hartree
dipole: 4.1792 -0.3346 -1.1633
dipole: 4.3510
quadrupole: -86.4410 -56.8115 -65.5068
quadrupole: -0.2701 -0.6169 -0.0250
quadrupole: -16.8546 12.7749 4.0797 -0.2701 -0.6169 -0.0250
hfenergy: -478.9084818 hartree
pointgroup: C01 [X(C9H11N1O1)]
dipole: -1.6555069 0.1680729 -0.4017362 debye
dipolederiv: -1.2097909 -0.063212 -0.0917958 0.2809917 -0.4482739 0.1007474 -0.3309203 0.0291452 -0.4460586 -1.1890369 -0.2310421 0.0901322 -0.4575034 -0.443319 -0.0419614 0.2076918 -0.0175972 -0.4874806 -0.0389994 0.0357803 0.0479114 0.0169134 0.0779526 -0.0140454 0.1652477 -0.0320937 0.0840518 0.2888712 -0.1097425 0.0723338 -0.1657962 0.0088213 -0.0187032 0.1345276 -0.0175344 -0.0856543 0.1226685 0.0642925 -0.0804124 0.3249444 0.36861 -0.017058 -0.3344829 -0.0072001 0.3102089 -0.1054806 0.0527669 0.0719371 0.11443 -0.0567388 0.0682326 0.085937 0.0689478 -0.1114096 -0.1914315 0.0134802 0.0239515 -0.0262418 0.0782434 0.0328634 -0.0022737 0.0554129 -0.1464565 -0.0403734 -0.0204253 0.0431873 -0.0522974 0.1216755 0.0421732 0.0367666 0.0494122 -0.1111115 0.0341154 0.0483415 0.0875686 0.0635229 0.0298629 0.0640785 0.0967754 0.0545451 -0.0859804 0.0085338 -0.0739763 0.086519 -0.0606913 -0.0698059 -0.0163823 0.0705314 -0.0138425 -0.1345596 1.9552757 0.2358643 0.1939702 0.1459454 0.6082035 -0.2339584 0.3692766 -0.1988411 0.2917415 -0.0066465 -0.0505777 0.0262371 -0.001378 -0.1184319 0.1068595 0.0102307 0.066882 0.0476791 0.0008194 -0.0016546 -0.0554902 -0.0336438 0.0119608 -0.1260847 -0.0610927 -0.0517116 -0.0362876 -0.018866 0.1211849 -0.0407059 0.0179883 0.0746004 0.0176758 0.0278079 0.0285963 0.0790399 0.0398013 -0.1181515 -0.0481815 -0.1229788 -0.0393875 -0.0545143 0.0035391 -0.0754136 -0.0691458 0.0003044 -0.0746214 -0.0966133 -0.0718465 0.0384054 -0.0462517 -0.1031919 -0.0579161 0.0844565 0.0985297 0.0638127 -0.0191555 0.0487116 -0.1043571 -0.0319919 -0.0207994 -0.0224218 0.1255936 0.2104789 0.0140326 -0.0717931 -0.0276458 0.0967879 0.0911781 -0.1329961 0.0605684 0.2963215 0.0844624 0.0383789 -0.0212049 0.058819 -0.1144203 -0.0407728 -0.0245222 -0.0414592 0.1358481 -0.0160052 -0.0731945 -0.0912343 -0.0827713 0.0198435 -0.0660466 -0.102211 -0.0621311 0.0984905 -0.0634607 0.0807695 -0.0861681 0.0846238 0.0540714 0.0148514 -0.0903316 0.0165305 0.1249629 0.0362306 0.0478936 -0.0409933 -0.0540961 -0.1943045 0.1691108 -0.00551 0.168122 0.0357503 unknown
polarizability: 135.8455071|-4.9239924|104.3101671|17.277877|1.7773669|65.5489262 unknown
InChI: InChI=1S/C9H11NO/c11-8-10-7-6-9-4-2-1-3-5-9/h1-5,8,10H,6-7H2
charge 0 multiplicity 1
22 atoms
O  4.272116 0.074664 -0.198265
N  2.001386 0.129599 -0.790302
C  0.614595 -1.039491 0.959506
C  -0.70402 -0.421433 0.515764
C  1.636775 -1.170853 -0.20739
C  -0.95877 0.96374 0.695415
C  -1.691188 -1.210652 -0.132293
C  -2.164341 1.545915 0.238052
C  -2.896624 -0.633693 -0.590099
C  -3.136717 0.748878 -0.408307
C  3.280263 0.64961 -0.728863
H  0.44403 -2.054747 1.366459
H  1.077395 -0.435809 1.761278
H  2.574008 -1.62548 0.156853
H  1.216857 -1.82498 -0.996052
H  -0.21514 1.583784 1.211351
H  -1.516853 -2.28555 -0.269543
H  1.260455 0.692011 -1.21596
H  -2.346431 2.615658 0.391957
H  -3.649693 -1.259952 -1.081778
H  -4.072973 1.19684 -0.759346
H  3.34817 1.65324 -1.208935
