program: Gaussian 09
title: 000140992
version: EM64L-G09RevD.01
frameworkgroup: C1[X(C9H14)]
method: RPBEPBE
basis: SDD
operation: Freq
keyword: #p
keyword: freq=noraman
keyword: PBEPBE/SDD
title: #p freq=noraman PBEPBE/SDD
converged: NO YES NO NO
title: Mulliken charges:
elementType: C C C C C C C C C H H H H H H H H H H H H H H
charge: -0.083354 -0.597720 -0.435644 -0.434167 0.393598 -0.585166 -0.403524 -0.474753 -0.299892 0.204462 0.223402 0.205824 0.210422 0.212957 0.203442 0.190984 0.206621 0.223177 0.210625 0.195963 0.208172 0.208262 0.216308
chargesum: 0.00000
title: Mulliken charges with hydrogens summed into heavy atoms:
elementType: C C C C C C C C C
charge: 0.121108 -0.168494 -0.012265 -0.039740 0.393598 -0.155368 0.003064 -0.058319 -0.083584
polarizability: 1.03197366e+02 3.94491524e+00 8.75474930e+01 2.32373972e+00 2.80796266e+00 7.85566131e+01
1716.lowfreq: -40.2006 -11.2980 0.0007 0.0008 0.0008 27.9338 150.3818 188.8396 290.4851
frequency: 150.3569 188.8212 290.4064 299.4884 344.6848 401.9849 439.1527 491.1441 541.8890 625.8373 714.2337 718.2304 786.0600 810.9289 824.8609 841.8658 870.4682 879.7912 910.2453 940.3431 958.4161 988.8675 999.0036 1017.8866 1062.6458 1089.6569 1114.0508 1136.8030 1161.6367 1168.3977 1181.2829 1191.5485 1211.9958 1243.0869 1262.9129 1279.6886 1288.1168 1296.6376 1312.8314 1331.9430 1350.3123 1359.8436 1456.0887 1457.6976 1462.3604 1466.4700 1475.7965 1492.1025 1683.4092 2948.0719 2960.9082 2984.7415 2992.5121 2994.1521 2998.1704 3002.1193 3008.3887 3019.2742 3053.2021 3054.9000 3079.3133 3087.1931 3094.9719
redmass: 2.0615 2.1728 2.2826 2.7059 1.9751 3.0874 2.1668 2.2799 1.7790 2.7182 3.1627 3.8206 1.8638 1.6202 2.5570 1.8907 1.6585 2.2728 2.2142 2.1026 2.0815 1.7638 1.8172 1.8113 1.9758 1.8967 1.3241 1.1932 1.2368 1.2016 1.8869 1.6779 1.3298 1.2576 1.2569 1.4316 1.3937 1.4612 1.2532 1.4962 1.4591 1.3192 1.0838 1.0801 1.1074 1.0856 1.1046 1.0984 7.6622 1.0604 1.0619 1.0730 1.0701 1.0649 1.0665 1.0863 1.0751 1.0986 1.1021 1.1029 1.1025 1.0983 1.0925
irintensity: 0.1213 0.4905 0.0304 0.6295 1.5542 0.2736 0.5128 1.2753 1.1867 5.1997 0.8234 14.9289 1.9782 2.5378 9.9276 20.9744 21.6543 3.1971 3.4181 0.1487 2.3111 7.4202 4.4735 2.9070 0.6860 1.3892 0.1678 5.7961 0.1609 3.0781 3.0535 2.9906 0.2601 1.0455 2.1122 1.9609 2.4614 0.9728 0.6864 0.1740 1.4841 0.9225 1.4187 3.5379 5.3748 14.6942 17.0373 11.8248 8.7552 18.1884 53.4579 15.0809 13.7253 94.1112 57.9847 62.6143 70.7112 92.0626 21.1963 37.9597 40.6204 28.0347 48.9886
temp: 298.150 k
press: 1.00000 atm
elementType: 6 6 6 6 6 6 6 6 6 1 1 1 1 1 1 1 1 1 1 1 1 1 1
symmnumber: 1
zpe: 543404.9 jmol-1
zpe.correction: 0.206972 hartree
zpe.thermalcorrener: 0.214604 hartree
zpe.thermalcorrenthalpy: 0.215548 hartree
zpe.thermalcorrgfe: 0.175505 hartree
zpe.sumelectzpe: -350.602110 hartree
zpe.sumelectthermal: -350.594477 hartree
zpe.sumelectthermalent: -350.593533 hartree
zpe.sumelectthermalfe: -350.633577 hartree
dipole: -0.1035 1.0880 -0.4703
dipole: 1.1898
quadrupole: -54.2069 -58.8896 -55.3438
quadrupole: 0.4841 0.1256 2.2790
quadrupole: 1.9399 -2.7428 0.8029 0.4841 0.1256 2.2790
hfenergy: -350.8090816 hartree
pointgroup: C01 [X(C9H14)]
dipole: 0.0079303 -0.4415782 -0.1551094 debye
dipolederiv: 0.0874867 0.0052158 0.0094185 0.0276492 0.1722533 -0.0238647 0.0154896 -0.0224645 0.0594387 0.0908809 -0.0128158 -0.0548513 -0.045955 -0.1087894 0.0888208 -0.1520763 -0.0270776 0.0446051 0.0211428 0.0510096 -0.0701642 0.0483899 0.0391498 0.006943 -0.0386913 0.0412899 0.0382482 0.0538376 -0.0301524 0.0140878 -0.0104191 0.0915167 -0.0053824 0.0143858 -0.0020517 0.1037259 0.0304598 0.1993055 0.1248983 0.349819 0.0078064 -0.1955872 0.2192231 -0.1271412 0.0092423 0.2080198 -0.0176401 -0.0795955 -0.1701643 -0.0077074 -0.0181063 -0.0913869 -0.0020894 0.090504 -0.0283058 -0.0191938 0.0489614 -0.0331972 0.1086793 -0.00182 -0.0375503 0.0064204 0.1384817 0.1907406 0.0314567 -0.0651744 0.179743 0.0194887 -0.0227538 0.075571 0.0118619 0.1022374 -0.0284737 -0.2030554 -0.0665637 -0.340208 -0.2481893 -0.0869629 -0.1021853 -0.2013731 0.0145467 -0.0518724 -0.1004033 0.0508486 -0.1029187 -0.1684052 0.1068514 0.0353555 0.088808 -0.0010189 -0.0472006 0.0117829 -0.1711699 0.0103219 0.0582072 0.0201048 -0.1002934 0.0145224 -0.0327116 -0.1167358 0.0330836 0.166894 0.0325228 0.0370224 -0.0312094 0.108833 -0.0194329 -0.0101677 -0.1700449 -0.1042448 -0.0458443 -0.1415263 -0.0312851 -0.0206912 -0.009477 0.0073912 0.0696561 0.0397519 0.0384984 0.1086767 0.010263 0.0181395 -0.0294379 0.0358548 -0.0644389 -0.1233044 0.0369872 -0.0368282 -0.0006695 -0.0087933 -0.1288547 -0.112868 0.0182615 -0.1599335 -0.0279749 -0.0312186 0.0595456 -0.0701757 0.0197184 0.0229452 0.0673551 -0.0759058 0.1312283 -0.1244896 -0.1735808 0.0628267 0.0635144 0.038411 0.0342286 -0.0175589 0.1261795 -0.0523603 0.0199512 0.0627875 -0.0150844 0.0208927 0.0356894 -0.0076916 0.0956565 -0.0597183 0.1245347 -0.1063803 0.0690195 -0.0242046 -0.0778055 -0.0498094 0.0176731 0.0533388 -0.0335735 0.0280149 -0.1616608 -0.1870645 0.1139459 0.035982 0.1744586 -0.0514725 -0.0274117 0.0093437 -0.0002908 0.0762431 -0.1559553 -0.0983144 0.0555719 -0.1108256 -0.0178247 0.0293534 0.1045678 0.0408439 0.052909 0.0626371 0.017578 0.002037 0.0398242 0.0531453 0.0384716 -0.0796459 -0.0050281 -0.1545044 0.0367012 0.0376887 0.0002308 0.0470066 0.0899645 0.086759 0.0174388 0.1887663 -0.077577 unknown
polarizability: 103.7611935|2.5058952|86.6267213|-2.5266642|-3.1499345|78.9135575 unknown
InChI: InChI=1S/C9H14/c1-2-4-9-6-5-8(3-1)7-9/h3,9H,1-2,4-7H2
charge 0 multiplicity 1
23 atoms
C  -0.721022 -1.181877 0.396576
C  -0.606394 0.052116 1.338599
C  -1.627181 -0.639934 -0.789532
C  0.716073 -1.685325 0.02643
C  -0.488421 1.117282 0.2552
C  -1.737026 0.933456 -0.59265
C  1.784329 -0.712449 -0.584967
C  1.969904 0.692053 0.090402
C  0.714808 1.47506 -0.269146
H  -1.229715 -2.032062 0.892165
H  0.244353 -0.010053 2.035035
H  -1.529776 0.197611 1.931825
H  -2.622105 -1.122179 -0.780241
H  -1.160136 -0.860478 -1.767199
H  0.62253 -2.542316 -0.672996
H  1.142126 -2.10307 0.963332
H  -2.67323 1.189767 -0.061821
H  -1.711669 1.476166 -1.552551
H  1.546103 -0.532096 -1.653328
H  2.752181 -1.255542 -0.572548
H  2.880697 1.173345 -0.311469
H  2.11337 0.582138 1.18123
H  0.743899 2.060687 -1.199648
