program: Gaussian 09
title: 000140981
version: EM64L-G09RevD.01
frameworkgroup: C1[X(C7H7NOS)]
method: RPBEPBE
basis: SDD
operation: Freq
keyword: #p
keyword: freq=noraman
keyword: PBEPBE/SDD
title: #p freq=noraman PBEPBE/SDD
converged: NO YES NO NO
title: Mulliken charges:
elementType: S O N C C C C C C C H H H H H H H
charge: 0.342761 -0.294237 -0.071690 -0.297254 -0.714803 -0.289226 -0.253727 0.234794 -0.166357 -0.294770 0.243725 0.265685 0.274384 0.289715 0.247147 0.226752 0.257099
chargesum: 0.00000
title: Mulliken charges with hydrogens summed into heavy atoms:
elementType: S O N C C C C C C C
charge: 0.342761 -0.294237 -0.071690 0.212156 -0.150703 -0.289226 -0.006580 0.234794 0.060395 -0.037670
polarizability: 1.35242435e+02 -5.71794900e+00 1.24365738e+02 2.45178257e-01 -1.03582213e+00 4.83296650e+01
1716.lowfreq: -7.0423 -3.6990 0.0009 0.0009 0.0012 8.0798 116.3363 134.3630 201.3255
frequency: 116.3359 134.3617 201.3251 221.7737 231.9380 424.7181 455.4782 468.0077 501.5772 540.5215 571.5640 602.0744 641.0622 670.0496 718.3865 751.5897 838.8197 856.7530 947.4116 973.1208 1005.0164 1016.6413 1044.3562 1097.9542 1141.7391 1171.9154 1189.2670 1205.6813 1274.7249 1314.6899 1324.5995 1353.9077 1441.8257 1455.3658 1464.9869 1471.4684 1531.4401 1573.3911 3010.4348 3055.1147 3085.8025 3141.5323 3150.3858 3170.9060 3209.9427
redmass: 5.6607 2.8950 3.3061 5.8335 4.9450 10.3101 4.6156 4.3421 5.4594 4.3453 5.6233 6.9388 3.5896 1.3232 3.1130 4.1041 1.5854 1.7812 1.2956 2.4870 1.6792 3.1666 3.3107 2.0352 1.7169 1.2878 1.3965 1.6414 1.2580 1.8303 1.9882 1.9817 2.0597 1.1991 2.5388 1.7846 4.4233 7.6386 1.0605 1.0613 1.1025 1.1084 1.0874 1.0954 1.0966
irintensity: 0.7729 1.9224 1.9065 3.5525 2.5790 6.0853 2.2129 0.0112 1.1800 0.0636 0.6905 7.2866 2.4649 59.1864 19.6843 13.6856 25.9003 3.4901 0.3136 1.4981 1.9931 1.7691 50.8812 27.7767 14.9161 10.7924 7.6674 2.4458 26.4828 43.3247 34.0700 2.9039 11.5435 5.1538 39.4742 12.2996 39.6580 201.0371 23.0183 16.0584 13.2772 7.4550 7.7280 9.4766 0.3810
temp: 298.150 k
press: 1.00000 atm
elementType: 16 8 7 6 6 6 6 6 6 6 1 1 1 1 1 1 1
symmnumber: 1
zpe: 333578.4 jmol-1
zpe.correction: 0.127053 hartree
zpe.thermalcorrener: 0.135362 hartree
zpe.thermalcorrenthalpy: 0.136306 hartree
zpe.thermalcorrgfe: 0.093664 hartree
zpe.sumelectzpe: -798.230327 hartree
zpe.sumelectthermal: -798.222019 hartree
zpe.sumelectthermalent: -798.221075 hartree
zpe.sumelectthermalfe: -798.263717 hartree
dipole: -3.7041 -7.6653 0.0959
dipole: 8.5138
quadrupole: -56.0195 -71.5546 -67.4198
quadrupole: -2.6383 -0.0433 0.3331
quadrupole: 8.9785 -6.5566 -2.4218 -2.6383 -0.0433 0.3331
hfenergy: -798.3573807 hartree
pointgroup: C01 [X(C7H7N1O1S1)]
dipole: 2.006983 2.6805222 0.0817319 debye
dipolederiv: -0.4137746 0.2561727 -0.0123297 0.3728137 -0.034314 0.0425091 0.0736836 -0.0176178 0.0095164 -0.4336982 -0.2843149 -0.0155992 -0.316329 -1.1473443 -0.0150375 0.0047585 -0.0150686 -0.3812363 -0.4283747 -0.1517204 0.0237599 -0.2659287 0.2321756 0.0196844 -0.0039311 -0.0448298 -0.0031061 0.3184695 0.1012189 -0.0655654 -0.0069928 0.1408547 0.0233667 -0.0401394 -0.0261083 0.2613457 0.1836492 0.0902204 0.0314934 0.1715093 -0.028769 0.0579793 0.0176717 0.0730229 0.1290941 0.6907952 -0.9535447 -0.0079554 -0.3141049 -0.0017123 -0.056938 -0.0617911 0.0142263 -0.10409 -0.3125463 0.1077319 -0.0047591 0.0243569 -0.3745569 0.0050236 0.0060205 0.0244587 -0.2396783 -0.1401707 0.5550594 0.025406 0.6085942 1.1338478 0.0341536 0.0058899 0.0335279 0.1404457 0.3693807 -0.0385701 -0.0065952 0.2800819 0.1762644 0.0117134 0.0013893 0.021172 -0.1074456 0.1153403 0.3115616 -0.0123118 -0.4012685 -0.2904299 -0.0079943 -0.0275772 -0.0185459 -0.1989834 0.075083 0.0149703 0.0054143 -0.0914492 -0.0641571 -0.0658024 -0.0223939 -0.073368 0.059781 -0.0066531 -0.0147866 0.002401 0.0149626 0.0587368 0.0167067 0.045366 0.0771618 -0.0882897 -0.0706823 0.0098574 0.0467067 -0.0157502 0.097325 -0.0110852 0.073887 -0.0066719 0.0754302 0.0559096 -0.0068035 -0.0284745 -0.1010292 0.048079 -0.0456816 -0.0826483 -0.0123196 -0.0903437 0.0330137 -0.0723906 0.001892 -0.0316027 0.003874 -0.0009378 -0.0018779 -0.0119347 0.2173565 0.021899 0.0982095 0.0070126 0.1090375 -0.0243133 -0.0082641 0.0074198 -0.0102288 0.1583495 -0.0576404 -0.0228713 0.0095046 -0.0369009 0.0744395 0.0006041 0.0042726 -0.0068762 0.1618537 unknown
polarizability: 132.6961184|-7.3505741|126.8712132|0.2678858|2.0358746|48.3705061 unknown
InChI: InChI=1S/C7H7NOS/c9-6-2-1-3-8-4-5-10-7(6)8/h1-3H,4-5H2
charge 0 multiplicity 1
17 atoms
S  1.544418 -1.666999 -0.087585
O  -1.52071 -2.198128 -0.062814
N  0.536965 0.824856 -0.026042
C  2.00905 1.055643 -0.195197
C  2.717174 -0.211484 0.315863
C  0.166404 -0.494745 -0.028712
C  -0.383728 1.85671 0.015145
C  -1.224599 -0.945173 -0.015754
C  -1.748623 1.509987 0.06148
C  -2.167646 0.168154 0.052567
H  2.308798 1.953356 0.371179
H  2.206015 1.220561 -1.270673
H  3.674003 -0.384044 -0.196573
H  2.862934 -0.192606 1.406643
H  0.001206 2.876217 0.018274
H  -2.483812 2.319151 0.109513
H  -3.231149 -0.088754 0.093984
