program: Gaussian 09
title: 000140974
version: EM64L-G09RevD.01
frameworkgroup: C1[X(C8H14Cl2)]
method: RPBEPBE
basis: SDD
operation: Freq
keyword: #pfreq=noraman
keyword: PBEPBE/SDD
title: #p freq=noraman PBEPBE/SDD
converged: YES YES NO NO
title: Mulliken charges:
elementType: Cl Cl C C C C C C C C H H H H H H H H H H H H H H
charge: -0.099193 -0.099193 -0.103865 -0.103865 -0.109562 -0.109563 -0.700624 -0.641783 -0.700624 -0.641783 0.263300 0.263299 0.251239 0.242268 0.207413 0.236796 0.240141 0.213871 0.251238 0.242268 0.207413 0.240141 0.213872 0.236795
chargesum: 0.00000
title: Mulliken charges with hydrogens summed into heavy atoms:
elementType: Cl Cl C C C C C C C C
charge: -0.099193 -0.099193 -0.103865 -0.103865 0.153737 0.153736 0.000296 0.049026 0.000296 0.049025
polarizability: 1.39499393e+02 -3.95775509e-05 1.03922357e+02 -8.48941414e+00 2.18275066e-05 9.18419300e+01
1716.lowfreq: 0.0013 0.0014 0.0027 5.6889 9.9532 13.1275 29.6216 70.0488 106.4480
frequency: 29.6123 70.0481 106.4416 132.3598 211.9431 238.8678 239.5454 252.1990 275.0088 283.2514 288.0806 288.9915 295.6532 337.0241 337.6172 394.8193 403.5168 458.0749 512.4157 522.2232 594.2372 805.8685 822.1923 864.9761 935.2888 936.4681 977.1929 990.2394 992.6319 1001.9051 1015.2882 1104.9899 1109.0338 1165.5240 1200.9537 1275.0643 1278.2543 1306.6936 1315.1294 1382.4385 1382.9062 1398.7479 1399.3657 1451.3940 1452.7774 1463.7413 1464.0094 1470.2091 1470.2660 1485.6788 1487.1804 1662.4332 2982.3625 2982.4927 2988.1925 2988.2708 3079.8541 3079.9264 3086.2862 3086.5102 3105.5883 3105.7335 3114.5483 3114.9539 3119.2680 3128.0207
redmass: 4.9125 6.3417 4.6454 3.0867 3.5956 1.0437 1.0226 2.2437 1.9681 1.2669 2.4733 1.1288 3.3136 3.5822 3.4621 4.3165 2.5146 3.2740 3.7560 3.2595 2.8427 3.6451 3.2978 1.9097 1.4414 1.4124 1.2856 1.8112 1.3002 1.2887 1.4847 1.6372 1.6966 2.2335 3.1050 3.0992 3.6914 1.5173 1.3660 1.2174 1.2162 1.2055 1.2047 1.0505 1.0537 1.0474 1.0484 1.0602 1.0625 1.0478 1.0510 6.4804 1.0374 1.0375 1.0389 1.0390 1.0963 1.0963 1.0949 1.0950 1.1011 1.1011 1.1004 1.1007 1.0947 1.0858
irintensity: 0.5758 0.0582 2.8983 0.1266 0.0018 0.0779 0.1386 0.2211 4.7473 0.5377 12.1247 0.1096 0.8664 11.5134 20.6583 12.6950 1.1375 15.0698 9.8085 20.4991 34.8701 6.2114 5.7316 3.6257 0.0862 0.5448 6.9456 4.5022 34.7251 2.7261 0.0092 31.4235 84.3839 3.2239 9.4391 1.3665 122.4137 24.8424 0.0001 39.9817 11.8971 7.5261 24.7619 1.9302 2.0189 12.1032 0.0030 3.2751 9.9740 18.1764 11.5157 0.6674 9.2595 14.5734 23.5225 15.6919 22.7245 0.6767 19.3245 29.1641 25.7180 1.1784 47.6270 6.6185 0.1893 14.7465
temp: 298.150 k
press: 1.00000 atm
elementType: 17 17 6 6 6 6 6 6 6 6 1 1 1 1 1 1 1 1 1 1 1 1 1 1
symmnumber: 1
zpe: 522186.6 jmol-1
zpe.correction: 0.198890 hartree
zpe.thermalcorrener: 0.211926 hartree
zpe.thermalcorrenthalpy: 0.212870 hartree
zpe.thermalcorrgfe: 0.159349 hartree
zpe.sumelectzpe: -1232.560149 hartree
zpe.sumelectthermal: -1232.547113 hartree
zpe.sumelectthermalent: -1232.546169 hartree
zpe.sumelectthermalfe: -1232.599690 hartree
dipole: 0.0000 4.4228 0.0000
dipole: 4.4228
quadrupole: -80.7748 -78.7772 -72.3666
quadrupole: 0.0000 4.8183 0.0000
quadrupole: -3.4686 -1.4710 4.9396 0.0000 4.8183 0.0000
hfenergy: -1232.7590392 hartree
pointgroup: C01 [X(C8H14Cl2)]
dipole: 0.000007 1.7400667 -0.0000187 debye
dipolederiv: -0.5823059 -0.1652888 0.1058998 -0.3530801 -0.5969822 0.173783 0.0961615 0.1563622 -0.3203028 -0.5823036 0.1652905 0.1058951 0.3530837 -0.5969929 -0.1737782 0.0961523 -0.1563567 -0.3202954 0.7948145 0.1482715 -0.1399192 0.2617815 0.7940758 -0.1859852 0.0299149 -0.187634 0.3849186 0.7948141 -0.1482733 -0.1399149 -0.2617787 0.7940867 0.185978 0.0299235 0.1876268 0.3849095 -0.1266512 0.0640355 0.0149439 0.2276587 -0.2760804 -0.0266828 -0.0321253 0.0467107 0.0241099 -0.1266568 -0.0640365 0.0149466 -0.2276644 -0.2760787 0.0266873 -0.0321219 -0.0467066 0.0241122 -0.059672 -0.0119812 -0.008859 0.0058979 -0.0449573 0.0038178 -0.0526021 -0.0200454 -0.1555947 -0.139605 0.0257698 0.0570146 -0.0043643 -0.0932002 -0.0341898 0.0022687 -0.0196383 -0.0296079 -0.0596725 0.0119805 -0.0088599 -0.0058981 -0.0449566 -0.0038202 -0.0526024 0.0200432 -0.1555951 -0.1396046 -0.0257682 0.0570152 0.0043637 -0.0931996 0.0341907 0.0022695 0.0196388 -0.0296084 0.0657911 -0.0097545 -0.0231248 0.0082275 0.1224646 -0.0107781 -0.0621101 -0.0106799 -0.0718702 0.0657909 0.0097546 -0.0231249 -0.0082276 0.122465 0.0107762 -0.0621102 0.0106778 -0.0718716 0.055987 0.0905112 0.0645463 0.0783242 -0.0144789 -0.0696737 0.051712 -0.0479863 0.0385776 -0.1276347 0.0013358 -0.0752557 -0.00801 0.110115 -0.0040398 -0.027107 0.007686 0.0899531 0.0743016 -0.0878342 0.0506098 -0.0757432 -0.0697798 0.0733269 0.0286062 0.0794612 0.0144011 0.1111088 0.0127511 -0.055273 -0.0029892 0.0858727 0.0138281 -0.0254648 -0.0327883 -0.1232676 -0.1489159 0.0231792 -0.0293462 -0.0082411 0.0921439 -0.0159323 -0.0471827 -0.0199086 0.0848562 0.0827827 -0.0587624 0.0387631 -0.0580539 -0.1091936 0.061473 0.0379281 0.0645374 0.0638265 0.0559843 -0.0905112 0.0645503 -0.0783246 -0.014474 0.0696738 0.0517147 0.0479868 0.0385749 -0.1276343 -0.001334 -0.0752559 0.0080128 0.1101149 0.0040404 -0.0271072 -0.0076861 0.0899533 0.074304 0.0878331 0.0506065 0.0757413 -0.0697858 -0.0733257 0.0286031 -0.0794595 0.0144046 -0.1489153 -0.0231776 -0.0293454 0.0082429 0.0921449 0.0159322 -0.0471825 0.019909 0.0848557 0.0827841 0.0587613 0.0387612 0.0580527 -0.1091968 -0.0614698 0.0379263 -0.0645341 0.063829 0.1111085 -0.0127522 -0.0552734 0.0029883 0.0858733 -0.013832 -0.0254649 0.0327842 -0.1232685 unknown
polarizability: 138.1261665|-0.0001768|103.9223568|-11.6459808|-0.000112|93.215156 unknown
InChI: InChI=1S/C8H14Cl2/c1-7(2,9)5-6-8(3,4)10/h5-6H,1-4H3
charge 0 multiplicity 1
24 atoms
Cl -2.744523 -1.530737 0.668419
Cl 2.744524 -1.530768 -0.668418
C  -1.979537 0.138931 -0.055315
C  1.979552 0.138922 0.055279
C  -0.544531 0.110886 0.406953
C  0.544546 0.110879 -0.406989
C  -2.204788 0.0721 -1.568561
C  -2.780838 1.261623 0.624375
C  2.2048 0.072122 1.568527
C  2.780863 1.261593 -0.624434
H  -0.41925 0.110026 1.497285
H  0.419266 0.110007 -1.497322
H  -1.702821 -0.802396 -2.013153
H  -3.282321 0.000904 -1.789374
H  -1.813847 0.990706 -2.047525
H  -2.6517 1.238125 1.719468
H  -3.856026 1.165284 0.398408
H  -2.42709 2.242295 0.251076
H  1.702818 -0.802356 2.013138
H  3.282332 0.000914 1.789342
H  1.813874 0.990745 2.04747
H  3.85605 1.165248 -0.398467
H  2.427125 2.242275 -0.251155
H  2.651723 1.238073 -1.719527
