program: Gaussian 09
title: 000140972
version: EM64L-G09RevD.01
frameworkgroup: C1[X(C12H24)]
method: RPBEPBE
basis: SDD
operation: Freq
keyword: #p
keyword: freq=noraman
keyword: PBEPBE/SDD
title: #p freq=noraman PBEPBE/SDD
converged: YES YES NO NO
title: Mulliken charges:
elementType: C C C C C C C C C C C C H H H H H H H H H H H H H H H H H H H H H H H H
charge: 0.045081 0.045081 -0.484545 -0.484787 -0.484547 -0.484785 -0.036324 -0.036325 -0.740740 -0.740903 -0.740739 -0.740902 0.181230 0.181230 0.188284 0.206680 0.207012 0.188305 0.188284 0.206684 0.207008 0.188305 0.192539 0.192539 0.208072 0.225666 0.205296 0.208023 0.225761 0.205349 0.205297 0.208072 0.225666 0.205347 0.208023 0.225762
chargesum: 0.00000
title: Mulliken charges with hydrogens summed into heavy atoms:
elementType: C C C C C C C C C C C C
charge: 0.226311 0.226311 -0.089581 -0.089469 -0.089579 -0.089473 0.156215 0.156214 -0.101705 -0.101770 -0.101705 -0.101769
polarizability: 1.55297855e+02 -4.49582011e-06 1.22650212e+02 -5.20122578e-01 1.99571260e-05 1.04430301e+02
1716.lowfreq: -18.1957 -1.8928 -0.0007 -0.0004 -0.0002 15.0080 36.0465 50.5500 52.8375
frequency: 36.0460 50.5392 52.6796 132.0363 164.4753 172.4246 194.5928 211.1526 213.2184 216.3966 250.8475 268.5165 340.3192 379.5642 380.8145 386.2879 402.2112 432.4373 456.2039 470.1176 487.8120 534.0749 763.4346 780.5582 825.3901 844.6569 864.8487 891.2317 910.2459 911.0751 932.7714 944.0543 946.6834 955.1020 970.4776 1001.2745 1017.4819 1058.4644 1076.0708 1094.3362 1107.0450 1110.5272 1129.8749 1166.4973 1170.4302 1175.4913 1175.6615 1219.6759 1223.7940 1247.5169 1262.6015 1282.1486 1284.4869 1301.9082 1312.7290 1313.0832 1316.0075 1327.0855 1327.4964 1335.1596 1338.2391 1367.9297 1376.4018 1376.6828 1393.4928 1394.2184 1455.9121 1456.7258 1464.9017 1467.5539 1467.6106 1470.0571 1474.7430 1474.9889 1481.8232 1481.9744 1493.6970 1494.3840 2917.7897 2920.2130 2942.4532 2942.8764 2946.0311 2950.5244 2956.1640 2959.5667 2967.7336 2967.7729 2970.9212 2971.0424 3025.4902 3027.7949 3031.8610 3034.1279 3056.4573 3056.4757 3063.5991 3063.6031 3073.8801 3074.2306 3078.0090 3078.2017
redmass: 2.3621 3.1025 2.3881 2.7856 1.9165 1.3126 1.2304 1.5157 1.1103 1.6623 1.9283 1.9967 1.8921 2.1820 2.9420 1.9236 2.8005 2.1778 3.1193 2.1487 2.4397 2.0433 2.3848 1.4888 1.8506 2.7853 2.4894 1.3226 1.1647 1.1688 2.1211 1.5860 1.7347 1.4005 2.2178 1.4594 2.1943 1.1484 1.6708 2.4891 2.8049 2.0536 2.1144 1.9416 1.7151 2.2196 2.0179 1.2731 1.5926 1.2309 1.2916 1.3299 1.2520 1.2553 1.4571 1.3170 1.4364 1.4380 1.4078 1.5661 1.6435 1.5002 1.2156 1.2131 1.2080 1.2048 1.0801 1.0838 1.0783 1.0563 1.0563 1.0946 1.0452 1.0466 1.0581 1.0588 1.0466 1.0479 1.0792 1.0796 1.0800 1.0811 1.0673 1.0609 1.0729 1.0648 1.0366 1.0365 1.0369 1.0370 1.0929 1.1001 1.0936 1.1003 1.0986 1.0986 1.0979 1.0980 1.0989 1.0988 1.0981 1.0980
irintensity: 0.0021 0.0028 0.0002 0.0817 0.0000 0.0000 0.1193 0.0498 0.0257 0.0003 0.0000 0.0000 0.6515 0.0871 0.0159 0.0000 0.0001 0.0000 0.0000 0.2326 0.0000 0.4773 0.0000 0.0000 5.4063 0.0000 10.2131 8.7411 0.0002 8.9357 0.6311 0.7970 0.0000 0.0001 0.6024 27.0330 0.0000 0.0002 0.0000 0.0000 0.1081 2.6099 1.2806 0.0000 18.6171 0.0000 0.0000 1.9867 6.9381 0.0000 0.0000 0.2545 2.6381 0.0017 1.2572 0.0089 15.5872 0.0001 0.0004 0.0002 0.0000 4.5539 41.9076 0.0010 0.0000 34.7411 0.0001 12.0418 19.7283 0.0012 0.3589 0.0038 0.0005 8.3556 11.7165 0.0000 0.0021 50.8483 5.8295 0.0000 0.0027 21.1618 33.6908 0.0022 0.0017 163.5379 0.0352 59.2947 73.1584 0.0175 92.3165 0.0220 0.0199 150.9251 2.3480 0.0104 12.7282 195.2210 0.0275 83.8126 95.5485 0.0261
temp: 298.150 k
press: 1.00000 atm
elementType: 6 6 6 6 6 6 6 6 6 6 6 6 1 1 1 1 1 1 1 1 1 1 1 1 1 1 1 1 1 1 1 1 1 1 1 1
symmnumber: 1
zpe: 872187.1 jmol-1
zpe.correction: 0.332199 hartree
zpe.thermalcorrener: 0.346796 hartree
zpe.thermalcorrenthalpy: 0.347740 hartree
zpe.thermalcorrgfe: 0.291100 hartree
zpe.sumelectzpe: -470.675733 hartree
zpe.sumelectthermal: -470.661135 hartree
zpe.sumelectthermalent: -470.660191 hartree
zpe.sumelectthermalfe: -470.716832 hartree
dipole: 0.0000 0.0006 0.0000
dipole: 0.0006
quadrupole: -80.3467 -79.8787 -77.9659
quadrupole: 0.0000 0.3582 0.0000
quadrupole: -0.9496 -0.4816 1.4312 0.0000 0.3582 0.0000
hfenergy: -471.0079313 hartree
pointgroup: C01 [X(C12H24)]
dipole: 0. -0.0002314 -0.0000004 debye
polarizability: 155.2839134|0.0000554|122.6502121|0.9897057|-0.0001659|104.4442426 unknown
InChI: InChI=1S/C12H24/c1-9(2)11-5-7-12(8-6-11)10(3)4/h9-12H,5-8H2,1-4H3
charge 0 multiplicity 1
36 atoms
C  1.518785 -0.002352 0.215503
C  -1.518746 -0.002359 -0.215715
C  0.736207 1.257607 -0.237727
C  0.736299 -1.26246 -0.237463
C  -0.736167 1.257615 0.237478
C  -0.736257 -1.262455 0.23728
C  2.99454 -0.001612 -0.300815
C  -2.994497 -0.001616 0.300612
C  3.772564 1.260629 0.150336
C  3.772866 -1.265842 0.144259
C  -3.772537 1.260614 -0.150553
C  -3.772818 -1.265855 -0.144436
H  1.554993 -0.002223 1.32981
H  -1.554961 -0.00226 -1.330022
H  0.761938 1.308833 -1.348064
H  1.231376 2.174123 0.134298
H  1.231316 -2.178768 0.135201
H  0.762375 -1.314279 -1.347782
H  -0.761901 1.308876 1.347813
H  -1.231335 2.174118 -0.134579
H  -1.231275 -2.178773 -0.13536
H  -0.762332 -1.314243 1.3476
H  2.954295 0.001136 -1.413079
H  -2.954246 0.001149 1.412876
H  4.825304 1.208285 -0.184998
H  3.339829 2.19021 -0.258769
H  3.776099 1.343442 1.255111
H  4.826705 -1.209503 -0.186962
H  3.343051 -2.193114 -0.273059
H  3.772652 -1.35662 1.248424
H  -3.776007 1.343458 -1.255326
H  -4.825295 1.208225 0.184715
H  -3.339858 2.190197 0.258607
H  -3.772706 -1.35659 -1.248605
H  -4.826629 -1.209565 0.186886
H  -3.34293 -2.193128 0.272804
