program: Gaussian 09
title: 000140948
version: EM64L-G09RevD.01
frameworkgroup: C1[X(C13H18O)]
method: RPBEPBE
basis: SDD
operation: Freq
keyword: #pfreq=noraman
keyword: PBEPBE/SDD
title: #p freq=noraman PBEPBE/SDD
converged: YES YES NO NO
title: Mulliken charges:
elementType: O C C C C C C C C C C C C C H H H H H H H H H H H H H H H H H H
charge: -0.269002 0.149584 0.387362 -0.723794 -0.736944 -0.723726 0.239771 -0.733599 -0.348240 -0.374739 -0.366292 -0.366579 0.321841 -0.538250 0.210953 0.237247 0.214053 0.210198 0.216461 0.217286 0.213413 0.211223 0.236590 0.234977 0.227215 0.242461 0.238558 0.249274 0.238558 0.219800 0.244365 0.219974
chargesum: 0.00000
title: Mulliken charges with hydrogens summed into heavy atoms:
elementType: O C C C C C C C C C C C C C
charge: -0.269002 0.149584 0.387362 -0.061541 -0.093000 -0.062501 0.239771 -0.271407 -0.105778 -0.136181 -0.117018 -0.128021 0.321841 0.145889
polarizability: 1.93974508e+02 5.01917408e+00 1.25482554e+02 -1.12918801e+01 3.47637141e+00 1.13278521e+02
1716.lowfreq: -5.9506 0.0002 0.0005 0.0007 3.3578 7.4634 19.3348 50.7657 57.3540
frequency: 11.2452 50.7139 57.3208 106.1253 134.3044 182.8829 206.7331 231.9457 246.4057 262.3792 272.2208 285.4166 309.7950 311.6263 361.8931 372.1810 388.6953 410.5476 450.8414 458.5320 525.9252 557.4035 616.4030 630.9889 684.6517 720.1120 732.3137 745.4477 799.1509 814.0197 836.3967 881.2397 920.4929 931.6708 935.8176 938.3844 943.9698 962.9042 988.6466 1002.9254 1022.2396 1023.8271 1088.2909 1107.4899 1111.9353 1156.2261 1177.4121 1205.0090 1208.3034 1218.9573 1226.7486 1295.8393 1299.0891 1353.4693 1371.3108 1373.5894 1396.7223 1408.8332 1420.1267 1436.0026 1458.0371 1466.6231 1469.5006 1471.9942 1473.8649 1479.4201 1485.0501 1497.0968 1501.1480 1571.8769 1616.3877 1638.7145 2956.9830 2972.3555 2972.8011 2977.7449 3043.3567 3064.5374 3066.6807 3073.5190 3074.3362 3082.4540 3085.6854 3098.0469 3123.3183 3132.7084 3136.7521 3158.6530 3166.1325 3199.2599
redmass: 3.3632 2.9319 3.7083 3.6404 3.5523 2.9526 1.4995 1.6227 1.4528 2.0699 1.1565 2.0765 1.7208 1.6250 2.6252 2.2426 3.1332 2.9653 3.3966 3.2662 3.4970 2.5895 6.4362 3.8112 5.1269 1.0549 4.0839 3.4383 4.0460 1.3377 1.5467 2.0180 1.7417 1.6152 1.3535 1.3493 1.2023 1.3377 8.6003 2.7677 1.3762 1.3815 1.9232 1.3619 1.2612 1.3417 1.2550 2.9159 2.4569 2.9715 3.2208 1.7481 2.0640 5.3046 1.1913 1.2042 1.2207 3.6465 1.2079 1.1698 1.0496 1.0502 1.0484 1.0758 1.0616 1.0584 1.0514 2.3089 1.0675 7.2706 6.0750 5.4666 1.0331 1.0346 1.0348 1.0357 1.1038 1.1004 1.0997 1.1000 1.0986 1.0994 1.0988 1.0622 1.0990 1.0883 1.0884 1.0950 1.0963 1.1136
irintensity: 0.6450 0.0726 0.9422 4.5188 1.1940 1.9308 0.7696 0.8045 0.9525 0.1969 0.1219 1.6029 0.6450 0.7017 0.1565 0.4536 0.6055 0.0187 0.4449 0.7863 11.6978 18.3034 0.6410 10.6529 7.9413 0.1365 6.3697 3.8499 1.5994 20.0617 54.3024 2.9075 0.0050 2.7636 56.4300 2.2256 0.1950 0.3897 43.0131 12.9060 0.5145 0.0261 15.1646 12.9742 0.2519 0.0638 73.7468 7.0065 33.2141 1.7538 178.2008 1.8819 1.8783 6.6448 22.2451 14.2781 27.0393 3.7925 5.0228 9.5231 0.0075 13.1186 1.7443 31.9501 30.7932 11.2729 7.3834 95.2810 22.1844 7.4629 50.8517 30.4673 69.0743 35.5155 26.9891 29.3886 50.3272 6.3509 8.6057 27.7071 89.7906 18.5353 62.1230 9.0004 29.9756 6.9101 12.1994 16.9246 4.5925 24.8199
temp: 298.150 k
press: 1.00000 atm
elementType: 8 6 6 6 6 6 6 6 6 6 6 6 6 6 1 1 1 1 1 1 1 1 1 1 1 1 1 1 1 1 1 1
symmnumber: 1
zpe: 715947.8 jmol-1
zpe.correction: 0.272690 hartree
zpe.thermalcorrener: 0.287751 hartree
zpe.thermalcorrenthalpy: 0.288695 hartree
zpe.thermalcorrgfe: 0.229939 hartree
zpe.sumelectzpe: -580.306095 hartree
zpe.sumelectthermal: -580.291034 hartree
zpe.sumelectthermalent: -580.290090 hartree
zpe.sumelectthermalfe: -580.348846 hartree
dipole: 0.5158 1.6257 -0.1123
dipole: 1.7093
quadrupole: -75.1692 -82.4941 -87.8959
quadrupole: 7.4824 1.4716 0.9118
quadrupole: 6.6838 -0.6410 -6.0428 7.4824 1.4716 0.9118
hfenergy: -580.5787849 hartree
pointgroup: C01 [X(C13H18O1)]
dipole: -0.1921328 -0.6359136 0.1045209 debye
polarizability: 193.7324661|8.6573622|123.5491266|9.8149591|-5.6888649|115.4539893 unknown
InChI: InChI=1S/C13H18O/c1-10(13(2,3)4)11-6-8-12(14-5)9-7-11/h6-9H,1H2,2-5H3
charge 0 multiplicity 1
32 atoms
O  -3.927085 0.195327 -0.46199
C  2.714889 -0.292121 -0.371672
C  1.727942 0.310216 0.660988
C  2.532452 0.423775 -1.744406
C  4.190664 -0.136517 0.073458
C  2.409547 -1.8094 -0.556565
C  0.250823 0.236761 0.35525
C  2.121945 0.898387 1.82344
C  -0.40633 1.286809 -0.345944
C  -0.537513 -0.854141 0.797566
C  -1.789361 1.244981 -0.600557
C  -1.929001 -0.915901 0.550163
C  -2.556248 0.139325 -0.155979
C  -4.762783 -0.92098 -0.01683
H  3.227106 -0.00913 -2.488727
H  1.504114 0.306361 -2.128287
H  2.749334 1.504857 -1.659847
H  4.856871 -0.580189 -0.689487
H  4.383849 -0.65325 1.031554
H  4.471127 0.926613 0.188954
H  2.540429 -2.358683 0.394425
H  3.101066 -2.24386 -1.302968
H  1.377126 -1.973387 -0.911409
H  3.174104 0.98838 2.111063
H  1.384341 1.309746 2.522219
H  0.175661 2.151534 -0.683451
H  -0.059111 -1.666426 1.356375
H  -2.296337 2.055133 -1.133684
H  -2.501524 -1.774782 0.913569
H  -4.437463 -1.8765 -0.473287
H  -5.778554 -0.674208 -0.359067
H  -4.754382 -1.017232 1.086733
