program: Gaussian 09
title: 000140946
version: EM64L-G09RevD.01
frameworkgroup: C1[X(C7H8)]
method: RPBEPBE
basis: SDD
operation: Freq
keyword: #p
keyword: freq=noraman
keyword: PBEPBE/SDD
title: #p freq=noraman PBEPBE/SDD
converged: NO YES NO NO
title: Mulliken charges:
elementType: C C C C C C C H H H H H H H H
charge: 0.284023 -0.546144 -0.546135 -0.306155 -0.306144 -0.238544 -0.238540 0.227432 0.223029 0.227436 0.223025 0.253770 0.253770 0.244588 0.244588
chargesum: 0.00000
title: Mulliken charges with hydrogens summed into heavy atoms:
elementType: C C C C C C C
charge: 0.284023 -0.095683 -0.095674 -0.052384 -0.052375 0.006044 0.006048
polarizability: 8.77903434e+01 -4.39259437e+00 5.82816150e+01 -2.91230947e-04 2.17225380e-04 5.81092133e+01
1716.lowfreq: -3.2807 -0.0003 0.0002 0.0008 9.6754 14.4820 160.6689 168.4220 275.4398
frequency: 160.6689 168.4193 275.4392 439.1270 450.2619 496.0005 707.7977 715.1460 843.9308 848.9918 864.3370 885.7374 911.8912 926.5897 941.5515 961.3000 1015.7929 1034.8157 1036.6962 1074.2703 1113.1415 1121.0413 1179.3900 1193.6830 1221.6445 1267.1847 1298.0870 1444.1465 1445.2417 1560.6777 1571.0771 2998.8652 3001.4135 3062.6521 3068.1800 3143.1568 3143.1882 3183.6039 3184.8992
redmass: 2.6292 2.8059 2.3953 1.8303 1.9045 4.5239 1.3817 1.4362 3.1183 2.6555 1.6830 1.4930 1.3197 1.4716 2.4093 1.8337 1.4454 1.7340 1.4159 1.4907 1.8256 1.6415 1.5976 1.3798 2.1211 1.8195 2.9456 1.1259 1.1092 5.3004 5.4304 1.0578 1.0579 1.1057 1.1060 1.0865 1.0859 1.1187 1.1171
irintensity: 0.1547 0.4100 0.0319 8.5284 9.0934 0.9657 57.5903 52.4439 2.2777 5.8584 19.5436 22.1516 1.8368 8.2343 12.8900 3.6390 2.9228 0.1388 1.3706 0.4661 4.9430 2.4642 12.0564 0.0000 1.3347 2.1536 15.6515 4.5814 4.7842 4.4091 1.5335 42.2205 38.0069 27.7780 30.0320 12.9008 7.0620 56.1354 9.6569
temp: 298.150 k
press: 1.00000 atm
elementType: 6 6 6 6 6 6 6 1 1 1 1 1 1 1 1
symmnumber: 1
zpe: 322752.7 jmol-1
zpe.correction: 0.122930 hartree
zpe.thermalcorrener: 0.129139 hartree
zpe.thermalcorrenthalpy: 0.130083 hartree
zpe.thermalcorrgfe: 0.093234 hartree
zpe.sumelectzpe: -270.911118 hartree
zpe.sumelectthermal: -270.904909 hartree
zpe.sumelectthermalent: -270.903965 hartree
zpe.sumelectthermalfe: -270.940814 hartree
dipole: 0.0000 0.0000 0.2273
dipole: 0.2273
quadrupole: -39.9375 -41.5979 -41.5648
quadrupole: -0.5846 0.0001 0.0000
quadrupole: 1.0959 -0.5645 -0.5314 -0.5846 0.0001 0.0000
hfenergy: -271.0340481 hartree
pointgroup: C01 [X(C7H8)]
dipole: 0.0000087 -0.0000827 -0.0894401 debye
dipolederiv: 0.0541905 -0.0345073 0.0000382 -0.1135046 0.0898847 0.0000213 0.0001351 0.0000148 0.0954049 -0.1344635 -0.0291462 -0.0126599 -0.0108747 0.0873949 -0.1254076 -0.0684001 -0.1199624 0.0850269 -0.1344648 -0.0291387 0.0127173 -0.0107551 0.0878758 0.1254074 0.0684162 0.1199628 0.0845274 0.0127492 -0.057938 0.077355 0.0640287 -0.0987011 -0.1801747 0.0004269 -0.1703248 -0.0879395 0.0127693 -0.058068 -0.0772373 0.0640442 -0.098026 0.1801817 -0.0005574 0.1703343 -0.0886156 0.0487236 0.0222985 0.0341252 -0.0595242 -0.0991535 0.1635625 -0.0630355 0.1581571 -0.1024999 0.0487363 0.0222573 -0.0341532 -0.0593704 -0.0997787 -0.1635692 0.0631696 -0.1581569 -0.1018622 0.0889059 0.0350576 0.0133847 -0.0016664 -0.180097 -0.0149749 0.0120835 0.0329844 0.0634292 0.0541223 0.0154649 0.0298086 -0.0052328 0.064327 0.0281179 -0.032913 -0.0207354 -0.1806261 0.0889042 0.0350511 -0.013457 -0.00167 -0.1801216 0.0154597 -0.0120793 -0.0324972 0.0634717 0.0541217 0.0154093 -0.0298477 -0.0051652 0.0643044 -0.0286108 0.0329159 0.0202428 -0.1806129 0.0630851 0.0126396 -0.0192021 0.0418115 0.0371713 0.1629731 -0.0505229 0.159953 0.0313934 0.0630912 0.0126658 0.0191649 0.0419026 0.0365459 -0.1629822 0.0504266 -0.1599656 0.0320147 -0.1602335 0.0190184 0.0328798 0.0280362 0.1440773 -0.0561618 0.0346096 -0.0552433 0.1435518 -0.1602375 0.0189357 -0.0329164 0.0279403 0.1442965 0.0561575 -0.0346753 0.0552362 0.1433363 unknown
polarizability: 87.3913085|5.5597336|58.6806489|-0.0055666|-0.0008168|58.1092143 unknown
InChI: InChI=1S/C7H8/c1-3-7(4-1)5-2-6-7/h1-3,5H,4,6H2
charge 0 multiplicity 1
15 atoms
C  -0.000012 -0.000063 -0.006757
C  -1.132221 -0.814258 -0.782772
C  1.132118 0.812689 -0.784411
C  1.159161 -0.697568 0.720786
C  -1.159116 0.698949 0.719462
C  -2.131138 0.002184 0.055618
C  2.131115 -0.002055 0.055533
H  -1.122073 -1.902518 -0.590029
H  -1.157664 -0.641492 -1.87388
H  1.121902 1.901333 -0.593862
H  1.157527 0.637721 -1.87517
H  1.168653 -1.466333 1.498746
H  -1.168532 1.469217 1.495934
H  -3.223867 0.00737 0.091344
H  3.223845 -0.007075 0.091258
