program: Gaussian 09
title: 000140922
version: EM64L-G09RevD.01
frameworkgroup: C1[X(C7H14O2)]
method: RPBEPBE
basis: SDD
operation: Freq
keyword: #pfreq=noraman
keyword: PBEPBE/SDD
title: #p freq=noraman PBEPBE/SDD
converged: YES YES NO NO
title: Mulliken charges:
elementType: O O C C C C C C C H H H H H H H H H H H H H H
charge: -0.196868 -0.196743 0.355004 0.355146 -0.561268 -0.737380 -0.713235 -0.713212 -0.737582 0.223645 0.223840 0.233000 0.213694 0.230238 0.243481 0.203096 0.225734 0.225533 0.243870 0.203001 0.230217 0.233025 0.213764
chargesum: 0.00000
title: Mulliken charges with hydrogens summed into heavy atoms:
elementType: O O C C C C C C C
charge: -0.196868 -0.196743 0.355004 0.355146 -0.113783 -0.060448 -0.040925 -0.040807 -0.060577
polarizability: 9.83177500e+01 1.37590096e+00 7.76944461e+01 5.83884716e-04 3.38932225e-03 7.17908221e+01
1716.lowfreq: -0.0011 -0.0009 -0.0009 8.7006 19.5124 20.8539 56.0998 171.6925 184.4071
frequency: 56.0375 171.6920 184.4023 185.0029 228.1888 240.5066 256.4488 291.8549 335.5266 343.2529 348.1045 420.5125 442.7961 462.9029 553.8765 598.2068 750.5013 751.9529 811.3625 820.0529 840.3454 893.1770 920.8028 934.3667 944.5120 974.6227 996.0191 1009.8118 1081.2147 1106.4665 1182.5890 1218.2223 1246.7877 1252.0933 1293.8940 1298.3921 1371.3047 1373.1688 1387.9530 1389.0952 1449.8878 1452.6175 1462.8680 1463.4214 1468.3423 1469.9739 1477.0581 1482.4353 1490.6030 2983.7075 2983.7830 2989.5447 2989.7826 3015.4501 3073.0436 3080.1306 3081.7285 3088.6959 3089.3906 3093.8843 3096.1420 3098.1907 3099.1742
redmass: 2.7183 2.9606 1.0777 1.0476 1.1974 1.0397 2.2017 2.2013 2.8422 2.6579 2.3711 2.0741 2.3152 4.1766 3.3598 5.5908 6.6081 5.1024 3.6735 9.5615 2.5475 1.7721 1.5280 1.3256 1.8306 1.7231 1.2887 1.4234 1.3867 1.7831 2.3771 2.3331 2.9383 3.3369 1.9812 1.6885 1.2480 1.2287 1.2124 1.2127 1.0541 1.0533 1.0504 1.0539 1.0546 1.0515 1.0764 1.0496 1.0632 1.0355 1.0355 1.0352 1.0354 1.0601 1.1045 1.0989 1.1001 1.0993 1.0987 1.1008 1.1005 1.1001 1.0999
irintensity: 0.2777 0.2999 0.8769 0.1013 0.9776 0.5805 0.7553 0.4487 4.1321 1.8754 2.9645 0.4213 5.5848 1.4299 0.2648 8.9917 4.3107 2.4838 1.7961 0.7235 0.0103 0.1885 0.2018 2.1788 0.6565 0.4096 0.0034 0.1433 0.2651 12.4122 25.1849 33.1122 4.8007 41.7512 0.1220 59.5552 1.2919 65.5385 22.7548 2.2402 0.5255 3.8424 0.7867 8.2077 8.1432 8.9636 24.4738 0.5450 14.7261 0.6749 39.5853 38.0630 3.1998 21.5083 12.7981 18.5594 0.3193 4.1238 59.9011 0.2819 50.6324 56.0750 6.2624
temp: 298.150 k
press: 1.00000 atm
elementType: 8 8 6 6 6 6 6 6 6 1 1 1 1 1 1 1 1 1 1 1 1 1 1
symmnumber: 1
zpe: 520063.8 jmol-1
zpe.correction: 0.198082 hartree
zpe.thermalcorrener: 0.208642 hartree
zpe.thermalcorrenthalpy: 0.209587 hartree
zpe.thermalcorrgfe: 0.163387 hartree
zpe.sumelectzpe: -424.775643 hartree
zpe.sumelectthermal: -424.765082 hartree
zpe.sumelectthermalent: -424.764138 hartree
zpe.sumelectthermalfe: -424.810337 hartree
dipole: 0.0012 0.0044 -3.4319
dipole: 3.4320
quadrupole: -51.3980 -55.5057 -60.3707
quadrupole: -0.0959 0.0019 0.0080
quadrupole: 4.3601 0.2525 -4.6126 -0.0959 0.0019 0.0080
hfenergy: -424.9737246 hartree
pointgroup: C01 [X(C7H14O2)]
dipole: -0.0129873 0.0394037 -1.3495958 debye
dipolederiv: -0.3620329 0.0361115 0.1221167 0.0831016 -0.3058868 -0.0026513 -0.0250447 0.0451614 -0.2908422 -0.361823 0.0426236 -0.1183917 0.0806793 -0.3042387 -0.0000183 0.0299588 -0.0472207 -0.2922505 0.5163195 -0.0793531 0.0020068 -0.1916149 0.4139029 0.0221024 0.1234435 0.0146553 0.2496948 0.5126989 -0.0785491 -0.011103 -0.1838662 0.4156797 -0.0081368 -0.1382668 -0.0029069 0.2515832 -0.3372794 0.008895 0.0028588 0.0896411 0.0647367 0.0018019 0.0057124 0.0028412 -0.0194634 -0.0431848 -0.0515698 -0.0345594 -0.0293842 -0.0595157 -0.0288379 -0.0743839 -0.0348324 0.0320406 -0.0395145 0.0437551 -0.0030402 0.0657305 -0.1835832 -0.0204275 -0.0128422 -0.0644485 0.0404688 -0.038737 0.0439008 0.0073949 0.0641603 -0.1884942 0.0058256 0.0190686 0.0505808 0.0437607 -0.0417955 -0.053358 0.0328044 -0.0333542 -0.0620214 0.0235935 0.0735482 0.0298364 0.03366 0.0703426 0.0072651 0.0001092 0.0076163 -0.0646842 -0.1343652 0.0122024 -0.0852601 -0.0128699 0.0696559 0.0087349 -0.0008647 0.0108881 -0.0790233 0.129853 -0.0131093 0.0807841 0.0014441 -0.0364908 -0.0260616 0.0960647 -0.0130594 0.0915662 -0.0205294 0.1501237 0.0186799 -0.0118632 0.0247458 0.0000779 -0.0759351 0.0073142 0.0717115 0.0629588 -0.1203687 0.0307873 -0.0742497 0.0454461 0.1148655 0.0115013 0.0677198 -0.1091249 -0.0314934 0.0171387 -0.021533 0.0928142 0.0171259 -0.1275626 -0.0483162 -0.0869947 -0.0164791 -0.0261384 -0.0230099 -0.0461938 0.0817425 0.04372 0.0425684 -0.058385 0.0563575 0.0559559 0.0399121 -0.0980436 0.0770929 -0.1079469 -0.0663451 0.0307695 0.1175662 -0.0147848 0.0799484 0.0306677 0.1389267 -0.0025961 0.002717 -0.0727345 0.0383206 -0.1142116 -0.0068549 0.081321 -0.0254462 -0.1378186 0.0066106 0.0072699 0.0186921 -0.1292896 0.0426751 -0.0879344 -0.019176 0.0218851 0.0196738 0.0431043 0.0841912 0.0479333 0.0374976 0.0563268 0.0501041 0.061723 -0.0317208 0.096802 -0.0686995 -0.1179631 0.0457461 0.1150216 -0.003646 0.0682029 -0.1121772 0.0180562 -0.0120872 0.0072174 0.0956603 -0.040881 -0.0199478 -0.0966757 -0.0030095 0.091076 0.0272639 -0.1501318 -0.0116657 -0.0069379 0.0283924 -0.0047157 0.0737036 -0.0006585 0.0767834 -0.0541549 0.1185081 -0.0219948 -0.0826606 unknown
polarizability: 98.265153|1.7177471|77.7403974|-0.1941728|0.1620308|71.7974678 unknown
InChI: InChI=1S/C7H14O2/c1-6(2)5-7(3,4)9-8-6/h5H2,1-4H3
charge 0 multiplicity 1
23 atoms
O  -0.644587 -0.386201 1.174635
O  0.680634 0.376758 1.184845
C  -1.241588 0.031396 -0.148586
C  1.251598 0.037449 -0.171625
C  -0.003799 0.065416 -1.104349
C  -2.258633 -1.074926 -0.471595
C  -1.896959 1.41573 0.009297
C  1.903306 -1.356284 -0.109142
C  2.267803 1.157546 -0.446265
H  -0.001974 -0.806708 -1.781488
H  -0.017544 0.980401 -1.722325
H  -3.029076 -1.135831 0.317031
H  -2.763573 -0.857139 -1.42992
H  -1.759813 -2.056379 -0.54978
H  -1.152053 2.144917 0.372419
H  -2.303085 1.772618 -0.955632
H  -2.721723 1.368814 0.741664
H  2.746019 -1.354827 0.604115
H  1.163397 -2.101913 0.23014
H  2.283692 -1.659433 -1.102493
H  1.772296 2.143718 -0.456706
H  3.052068 1.167943 0.330884
H  2.754794 0.995633 -1.424723
