program: Gaussian 09
title: 000140916
version: EM64L-G09RevD.01
frameworkgroup: C1[X(C10H20S2)]
method: RPBEPBE
basis: SDD
operation: Freq
keyword: #pfreq=noraman
keyword: PBEPBE/SDD
title: #p freq=noraman PBEPBE/SDD
converged: YES YES NO NO
title: Mulliken charges:
elementType: S S C C C C C C C C C C H H H H H H H H H H H H H H H H H H H H
charge: 0.198418 0.183252 0.265875 -0.735068 -0.420800 -0.361749 -0.297870 -0.687518 -0.684858 -0.687675 -0.661527 -0.686887 0.305460 0.262886 0.263026 0.192376 0.247017 0.235914 0.207680 0.206033 0.229123 0.228169 0.203188 0.206156 0.207317 0.235736 0.240113 0.212183 0.218399 0.212506 0.228074 0.235051
chargesum: 0.00000
title: Mulliken charges with hydrogens summed into heavy atoms:
elementType: S S C C C C C C C C C C
charge: 0.198418 0.183252 0.265875 -0.429608 -0.157913 -0.098724 0.141522 -0.037891 -0.024378 -0.038465 0.009167 -0.011257
polarizability: 1.73314629e+02 -7.87226041e-01 1.41424998e+02 -1.93076762e+00 -1.22296358e+00 1.11642668e+02
1716.lowfreq: -15.4566 -0.9431 -0.0027 -0.0015 0.0020 9.4799 48.5593 64.4761 87.8891
frequency: 48.5032 64.4443 87.8837 148.6462 152.1088 184.8621 202.5282 212.6539 217.4868 228.5373 238.4558 260.5216 275.5670 280.0751 305.7358 326.8881 347.1622 374.4414 391.7676 399.2455 408.4069 478.3824 564.7959 575.4849 616.1626 680.3724 720.0100 754.4406 842.4095 883.9959 910.6791 924.9241 927.0110 930.7234 946.9815 993.6161 1004.5187 1019.6370 1023.2096 1045.4229 1090.9771 1106.8227 1152.9901 1155.9201 1172.3804 1197.3038 1219.9082 1235.5859 1243.9632 1268.1024 1281.6848 1291.0585 1306.7623 1358.6094 1373.7901 1377.7363 1386.5290 1390.8050 1403.8312 1431.5743 1452.0015 1460.9041 1464.0232 1464.4256 1467.9800 1474.6201 1476.2116 1477.1593 1479.3066 1494.0188 2948.4141 2972.7663 2975.3711 2975.8943 2978.7576 2981.0294 3010.6034 3020.2964 3024.1282 3042.0525 3064.2379 3066.2328 3070.0635 3073.5789 3077.6249 3081.4242 3087.5942 3087.9970 3089.9244 3095.6395
redmass: 2.5550 4.2191 4.0255 2.4099 2.5972 1.2570 1.0915 1.4162 1.3436 1.8866 1.1423 2.9864 3.2932 2.1085 2.9253 3.3145 3.1268 2.5292 2.9549 2.4839 3.1261 2.4958 3.6944 3.8221 3.6354 5.0625 6.6358 3.6931 2.3151 1.7009 2.2322 1.9132 1.6828 1.6735 1.2040 1.3732 1.3182 1.4322 1.4003 1.6949 2.3022 1.7916 1.9955 1.5454 1.1228 1.3023 2.8548 1.8464 1.7501 1.3550 1.8344 1.2952 1.3367 1.4510 1.1910 1.1969 1.2046 1.2091 1.2009 1.0846 1.0495 1.0469 1.0467 1.0469 1.0453 1.0540 1.0547 1.0476 1.0470 1.0609 1.0648 1.0355 1.0357 1.0381 1.0356 1.0359 1.0855 1.0856 1.0853 1.0946 1.1000 1.0960 1.0994 1.0989 1.0992 1.1001 1.0989 1.0999 1.0987 1.0993
irintensity: 0.0302 1.3196 0.7440 0.9158 0.0387 0.2576 0.2086 0.0455 0.3037 0.3472 0.1089 0.7802 0.5667 0.5139 1.6440 0.0277 0.4627 0.5922 0.6491 1.8711 1.7883 0.3174 2.0985 5.8470 2.0490 3.1582 40.4146 0.7328 1.1613 4.9462 14.9107 4.5448 0.8569 2.8538 0.0215 0.4735 10.0444 0.6604 1.8948 23.5442 1.8809 7.6971 2.1906 5.5898 23.5579 8.3813 1.3285 63.7151 0.1984 3.9606 1.4332 4.5361 0.5270 2.4692 25.5295 27.6238 17.9816 24.4392 27.7188 8.3140 0.1478 0.6858 6.9653 0.2699 21.0510 14.0532 14.3842 11.3518 6.8475 23.2634 42.1528 19.6223 31.8969 41.2328 40.7325 22.0264 10.9324 13.0627 12.6926 19.0224 0.9502 40.8946 42.6118 31.9194 61.3097 3.6036 27.2684 30.7330 51.3033 28.1798
temp: 298.150 k
press: 1.00000 atm
elementType: 16 16 6 6 6 6 6 6 6 6 6 6 1 1 1 1 1 1 1 1 1 1 1 1 1 1 1 1 1 1 1 1
symmnumber: 1
zpe: 729000.2 jmol-1
zpe.correction: 0.277662 hartree
zpe.thermalcorrener: 0.293147 hartree
zpe.thermalcorrenthalpy: 0.294092 hartree
zpe.thermalcorrgfe: 0.236341 hartree
zpe.sumelectzpe: -1188.194393 hartree
zpe.sumelectthermal: -1188.178907 hartree
zpe.sumelectthermalent: -1188.177963 hartree
zpe.sumelectthermalfe: -1188.235714 hartree
dipole: -1.6978 0.5391 1.5629
dipole: 2.3698
quadrupole: -81.7317 -94.2792 -92.5183
quadrupole: -1.9039 0.1688 0.6727
quadrupole: 7.7780 -4.7695 -3.0085 -1.9039 0.1688 0.6727
hfenergy: -1188.4720548 hartree
pointgroup: C01 [X(C10H20S2)]
dipole: 0.6650431 -0.2173688 0.6162166 debye
polarizability: 173.2777101|-0.15488|141.2875445|2.658135|2.25805|111.8170408 unknown
InChI: InChI=1S/C10H20S2/c1-7-6-8(2)12-9(11-7)10(3,4)5/h7-9H,6H2,1-5H3
charge 0 multiplicity 1
32 atoms
S  -0.081695 -1.480123 -0.916649
S  0.264978 1.554996 -0.201417
C  -2.225891 0.154102 0.043563
C  -0.683781 -0.048868 0.178675
C  1.744856 -1.565481 -0.351876
C  2.01528 0.968886 0.295059
C  2.482063 -0.222936 -0.563185
C  -2.676003 1.2817 1.016652
C  -2.624208 0.530684 -1.408085
C  -2.948559 -1.159776 0.459374
C  1.874011 -2.14764 1.069093
C  2.941421 2.186843 0.131539
H  -0.440994 -0.315327 1.223339
H  2.153743 -2.293858 -1.077301
H  1.954173 0.687507 1.362867
H  3.556395 -0.398431 -0.333617
H  2.417478 0.064651 -1.629642
H  -2.229695 2.255122 0.750669
H  -3.776797 1.381703 0.979355
H  -2.388226 1.048422 2.059297
H  -2.336056 -0.261637 -2.121829
H  -2.133938 1.46787 -1.727162
H  -3.718985 0.672724 -1.470682
H  -2.664292 -1.464945 1.484379
H  -4.042755 -0.999986 0.440777
H  -2.707843 -1.99298 -0.222813
H  1.422701 -3.152934 1.117181
H  2.941383 -2.229621 1.354657
H  1.373206 -1.5193 1.826537
H  3.96711 1.930943 0.458117
H  2.987798 2.50555 -0.92589
H  2.589823 3.042641 0.734417
