program: Gaussian 09
title: 000140913
version: EM64L-G09RevD.01
frameworkgroup: C1[X(C8H9NO7)]
method: RPBEPBE
basis: SDD
operation: Freq
keyword: #pfreq=noraman
keyword: PBEPBE/SDD
title: #p freq=noraman PBEPBE/SDD
converged: YES YES NO NO
title: Mulliken charges:
elementType: O O O O O O O N C C C C C C C C H H H H H H H H H
charge: -0.204492 -0.234296 -0.265910 -0.178211 -0.198169 -0.162067 -0.210999 0.133418 0.175327 -0.107616 -0.244269 -0.201429 0.237654 0.345449 -0.759598 -0.496807 0.295820 0.287960 0.281261 0.251822 0.269268 0.246935 0.257319 0.245896 0.235736
chargesum: 0.00000
title: Mulliken charges with hydrogens summed into heavy atoms:
elementType: O O O O O O O N C C C C C C C C
charge: -0.204492 -0.234296 -0.265910 -0.178211 -0.198169 -0.162067 -0.210999 0.133418 0.175327 0.188204 0.043691 0.079833 0.237654 0.345449 0.008426 0.242144
polarizability: 1.47566741e+02 1.11425370e+01 1.17470505e+02 9.49873278e-01 7.72993522e-01 8.84492112e+01
1716.lowfreq: 0.0007 0.0009 0.0012 1.2736 5.3256 9.4851 33.2238 44.2649 52.4220
frequency: 33.1339 44.2571 52.3994 71.3167 73.9959 90.1228 102.9709 105.0597 119.5086 156.5508 182.9520 221.4374 259.0164 272.3384 306.9805 321.4761 342.7928 391.8455 423.6780 478.5818 533.8098 565.7580 593.4371 638.8442 663.3761 694.5952 736.9643 749.4938 771.4718 801.5598 804.2613 858.8703 882.6267 933.7454 942.0854 968.3550 986.2592 996.2847 1043.8523 1060.8872 1107.3352 1116.6636 1120.5145 1150.7274 1171.5483 1184.3767 1201.9271 1248.0899 1261.7944 1304.8859 1383.5770 1421.7456 1443.2830 1450.5553 1452.1346 1452.9263 1465.0423 1619.4309 1667.4718 1675.3056 3008.7536 3008.7871 3093.6401 3098.5115 3114.3393 3146.3606 3156.0474 3209.1252 3237.4938
redmass: 6.4492 7.5648 5.3933 2.6288 3.2298 2.1300 2.2151 1.3267 4.9032 6.4821 5.7294 5.6454 5.2335 7.0060 4.1811 7.1088 4.7402 7.1724 5.9117 6.2965 4.3343 3.5017 8.4488 8.5464 3.8621 7.5619 3.5446 6.7986 6.3942 3.1451 6.3410 4.3178 6.4008 6.0200 1.4547 2.4795 2.1902 3.1473 1.6637 4.5939 3.0247 1.4481 1.3905 1.4850 3.9962 3.1648 4.6863 2.0852 1.3873 1.8638 1.2401 1.1705 7.2333 1.0620 1.0632 1.0495 1.0502 6.8642 11.0277 10.2573 1.0304 1.0358 1.0883 1.0966 1.1051 1.1015 1.1052 1.0888 1.1100
irintensity: 3.1854 0.2680 1.0502 0.9347 2.9389 2.2504 3.9947 1.8918 2.4058 1.8036 1.0591 3.3780 1.9469 15.5246 5.2570 12.5928 6.5197 7.6992 1.4080 4.5441 10.5450 9.9225 7.3526 14.2717 5.2227 19.5551 20.1970 46.5022 15.2565 38.3688 25.9228 46.4174 21.6081 266.4021 28.6457 0.9316 47.1787 44.1689 9.3290 312.0565 71.6023 20.2295 0.9822 30.5951 143.3301 87.6118 125.3275 56.0083 12.0667 16.8547 59.0685 15.7092 144.1453 25.6536 23.9054 16.0633 12.6355 0.7628 182.2436 165.9054 24.5028 4.9042 4.1028 3.5532 17.6598 8.0592 12.6231 2.6090 0.1855
temp: 298.150 k
press: 1.00000 atm
elementType: 8 8 8 8 8 8 8 7 6 6 6 6 6 6 6 6 1 1 1 1 1 1 1 1 1
symmnumber: 1
zpe: 450091.0 jmol-1
zpe.correction: 0.171431 hartree
zpe.thermalcorrener: 0.187979 hartree
zpe.thermalcorrenthalpy: 0.188923 hartree
zpe.thermalcorrgfe: 0.125440 hartree
zpe.sumelectzpe: -890.234142 hartree
zpe.sumelectthermal: -890.217594 hartree
zpe.sumelectthermalent: -890.216650 hartree
zpe.sumelectthermalfe: -890.280132 hartree
dipole: 3.0714 -1.2306 4.1341
dipole: 5.2952
quadrupole: -92.3528 -82.1508 -93.8191
quadrupole: 4.8945 5.2217 -2.6334
quadrupole: -2.9119 7.2901 -4.3782 4.8945 5.2217 -2.6334
hfenergy: -890.4055727 hartree
pointgroup: C01 [X(C8H9N1O7)]
dipole: 1.1715654 -0.7674696 1.5422312 debye
dipolederiv: -1.1545942 -0.0544217 -0.0755425 -0.0863042 -0.3855999 0.0864672 -0.1685686 -0.0859499 -0.3556342 -0.8469983 -0.4866497 0.1678512 -0.7886963 -1.2927982 0.1018859 0.2178974 0.1762118 -0.4772859 -1.3489703 0.2565948 -0.2607601 0.195206 -0.4153435 -0.0706022 -0.3832588 0.0127626 -0.5582816 -0.5601261 0.146277 0.0493105 0.0086528 -0.5305498 -0.3154299 -0.2110446 -0.2443579 -0.6795247 -0.9852201 -0.1340116 -0.0195709 0.0389975 -0.4862072 -0.0237868 0.1001747 -0.0263742 -0.2051631 -0.5511233 -0.0184414 0.0138771 -0.0340561 -0.7631257 0.0112191 0.0432576 -0.1017461 -0.1352258 -0.5402466 -0.1446059 0.2221235 0.0159283 -0.6976915 -0.1712624 0.4266115 0.1084744 -0.6998006 1.2511169 0.1228228 0.0126902 0.0232009 1.0883781 0.0358704 -0.1753276 0.1456955 0.0260709 0.9081881 0.2482035 0.125589 0.3987468 0.8894876 -0.0025727 0.5618115 0.2153021 0.3008669 0.8852328 -0.0186956 -0.0050795 0.0991259 0.1962732 0.0048554 -0.2124628 0.0544758 0.3994928 -0.1028456 0.0900876 0.0118633 0.2121715 -0.1661097 -0.1042462 -0.0415633 -0.0391861 -0.0160936 -0.0627958 0.017297 0.0396729 -0.0309849 -0.1264102 -0.1042147 0.1853999 -0.1783105 -0.0685565 1.3455761 -0.2904345 0.2313397 -0.2781303 0.6671859 0.4198391 0.4970015 0.2014108 0.9537198 0.891975 0.5318713 -0.4275792 0.4641969 1.4564781 0.1334381 -0.7758277 -0.2129195 0.9554044 -0.0284842 0.0603833 0.0499521 -0.041524 -0.3377458 -0.1623695 0.0357274 -0.2034799 -0.1019269 0.6480137 -0.1368973 0.0157919 -0.1704533 0.299164 -0.0271141 -0.0611018 0.0055657 0.2162912 -0.0452621 -0.0454649 -0.0397075 0.0303347 0.0602337 -0.0174614 -0.0398156 -0.0223606 0.037623 0.1005219 -0.0000672 -0.0447019 -0.0178124 0.1570434 0.0452446 -0.0321344 0.0629858 0.0689127 0.0653059 -0.0481578 0.0311196 -0.0497271 0.1428455 0.0687221 -0.0081296 0.0631572 0.1004628 0.1182115 -0.0272759 -0.0595793 0.0218437 0.0872209 0.0530117 -0.0468585 0.0187067 -0.0343051 -0.0195146 0.0491446 -0.0148819 0.0297059 0.097298 -0.0183384 -0.0102681 0.0083801 0.1370102 0.0394394 -0.1023691 0.051504 -0.0784607 0.0173634 0.0168735 0.0691346 0.0471775 0.0630271 0.0048262 0.0110176 0.0096124 -0.006659 0.0325382 0.0917103 0.10713 0.0631092 -0.0076788 0.0083574 -0.0433908 -0.0121106 0.046389 -0.1006734 -0.0215522 0.0422163 -0.059486 0.0996387 -0.0205837 0.0171843 -0.0727838 -0.0016917 0.110745 -0.0301867 -0.1200009 -0.0092446 -0.0190439 unknown
polarizability: 149.6825207|7.4887821|115.0201711|0.8116486|3.106636|88.7837655 unknown
InChI: InChI=1S/C8H9NO7/c1-5(10)15-8(7(11)14-2)4-3-6(16-8)9(12)13/h3-4,6H,1-2H3
charge 0 multiplicity 1
25 atoms
O  -0.701962 -0.270864 -0.865586
O  0.603814 0.851773 0.829121
O  2.604975 -1.032036 0.467788
O  1.547367 -1.801119 -1.471105
O  -4.215159 0.020165 -0.041235
O  -2.554211 1.592706 0.009335
O  1.905682 1.472708 -1.01403
N  -2.991682 0.40521 -0.125995
C  0.299837 -0.440389 0.19952
C  -1.956395 -0.78437 -0.406443
C  -0.394036 -1.282727 1.255685
C  -1.684742 -1.490682 0.903005
C  1.54225 -1.138807 -0.421307
C  1.376405 1.775529 0.070453
C  1.410482 3.103089 0.780223
C  3.876066 -1.648469 0.009184
H  -2.450543 -1.363694 -1.201557
H  0.125769 -1.617512 2.152461
H  -2.452558 -2.036202 1.451093
H  1.703775 2.969211 1.834875
H  0.397113 3.542739 0.77345
H  2.110191 3.780998 0.271239
H  4.246608 -1.106107 -0.876215
H  3.71571 -2.708972 -0.246897
H  4.563444 -1.539378 0.858935
