program: Gaussian 09
title: 000140903
version: EM64L-G09RevD.01
frameworkgroup: C1[X(C12H20N2O)]
method: RPBEPBE
basis: SDD
operation: Freq
keyword: #p
keyword: freq=noraman
keyword: PBEPBE/SDD
title: #p freq=noraman PBEPBE/SDD
converged: YES YES NO NO
title: Mulliken charges:
elementType: O N N C C C C C C C C C C C C H H H H H H H H H H H H H H H H H H H H
charge: -0.276228 -0.083703 -0.125073 -0.152866 -0.243431 -0.467473 -0.494239 -0.359435 0.173214 -0.639370 -0.448118 -0.293210 0.380931 -0.784639 -0.791840 0.228696 0.269916 0.224826 0.235525 0.241738 0.245886 0.199748 0.246423 0.197142 0.229627 0.234138 0.262487 0.210023 0.242991 0.215254 0.233649 0.218187 0.224170 0.218110 0.226944
chargesum: 0.00000
title: Mulliken charges with hydrogens summed into heavy atoms:
elementType: O N N C C C C C C C C C C C C
charge: -0.276228 -0.083703 -0.125073 0.075830 0.026486 -0.007122 -0.006615 0.086736 0.173214 0.021536 0.024392 -0.050220 0.380931 -0.117550 -0.122615
polarizability: 1.77375297e+02 -1.30835401e+01 1.31530992e+02 5.79124330e+00 -4.11866330e+00 1.21317528e+02
1716.lowfreq: -12.5412 -7.8537 -0.0007 0.0001 0.0005 11.6440 21.3641 36.1301 47.7445
frequency: 20.6812 35.6777 47.6947 88.9313 109.1746 121.5516 165.2536 175.6542 195.6284 208.4554 213.6345 248.9336 291.2688 309.8099 333.5753 362.1224 395.2082 413.4850 432.2976 496.5455 508.0875 542.0214 624.3322 660.1222 695.9401 712.0839 772.4993 775.6341 804.0103 832.2150 838.5293 868.4246 905.3538 937.3838 946.6137 974.1661 979.8436 994.6500 997.7259 1022.0969 1023.8343 1055.2831 1070.9773 1082.1159 1105.7875 1114.1959 1126.3922 1149.4715 1156.8356 1168.0545 1198.6345 1207.7913 1213.0056 1230.8553 1244.2308 1261.1790 1277.0778 1287.8764 1294.2997 1319.2296 1333.7842 1344.9148 1363.4381 1388.2536 1398.6212 1423.4761 1428.5944 1451.1895 1455.3260 1460.7561 1465.2704 1467.5679 1471.1824 1476.6901 1479.3351 1484.1515 1484.2303 1596.9813 1693.8713 2891.2152 2959.2996 2959.8864 2965.7787 2991.8456 3009.4139 3014.0873 3022.0035 3029.3912 3030.6451 3034.4270 3049.9742 3051.1641 3068.9261 3082.9886 3083.6141 3090.9002 3091.0370 3095.7612 3096.1491
redmass: 3.0096 3.4979 3.1649 3.4394 1.5525 1.4979 1.8387 1.5653 1.3381 3.1153 1.8588 2.6787 2.5702 3.3826 2.1321 2.3200 2.6158 5.4012 2.7346 3.2562 2.8966 3.2706 3.6299 6.5906 4.0511 3.2982 2.5483 3.6098 1.9171 2.1336 2.9034 1.6425 2.7759 2.2316 1.3781 2.2922 2.1782 1.3475 1.7469 2.0442 2.2587 2.0643 1.7687 1.6710 1.6113 2.1972 1.8274 1.7606 1.6700 2.1036 1.4598 1.3923 2.1676 1.3732 1.3689 1.5512 1.3898 1.4749 1.7660 1.4728 1.5144 1.5848 1.4335 1.2883 1.2237 2.1380 1.1888 1.0921 1.0541 1.0828 1.0607 1.0543 1.0454 1.0851 1.0950 1.1312 1.0778 8.0788 6.3663 1.0527 1.0375 1.0592 1.0385 1.0586 1.0623 1.0987 1.0646 1.0770 1.0969 1.0964 1.1010 1.0888 1.1025 1.0981 1.1006 1.1020 1.0952 1.0910 1.0914
irintensity: 0.0747 1.2607 0.9580 2.6746 0.1865 0.1054 0.7646 1.8069 0.4751 2.8572 0.5377 1.5360 1.3281 10.2916 4.4323 0.5069 2.6958 1.4261 11.4985 4.2987 12.4914 2.9087 14.2505 5.2516 0.6910 11.6697 3.8112 5.4066 9.3081 2.7578 12.4648 17.7422 1.6118 5.4995 0.3631 11.8032 15.9515 6.9553 3.8255 11.0619 7.5929 3.8302 5.5195 3.5865 0.9380 31.7464 25.2343 42.1394 3.1927 5.6074 5.9924 27.2549 9.0624 7.0941 11.7739 52.5020 8.3750 1.2679 17.9807 24.6412 3.1473 15.5518 2.4683 27.6930 12.9099 40.1520 5.0500 18.4493 0.0185 8.8531 11.1519 15.5195 26.6427 20.9176 17.9056 12.0780 18.9748 289.6980 6.4930 108.6392 36.0633 40.2676 55.7981 48.9814 21.1756 18.7506 48.6900 47.6406 5.9656 46.0053 6.1371 34.2175 6.1263 19.2345 21.4831 41.8990 24.7997 18.2330 41.5225
temp: 298.150 k
press: 1.00000 atm
elementType: 8 7 7 6 6 6 6 6 6 6 6 6 6 6 6 1 1 1 1 1 1 1 1 1 1 1 1 1 1 1 1 1 1 1 1
symmnumber: 1
zpe: 795101.5 jmol-1
zpe.correction: 0.302838 hartree
zpe.thermalcorrener: 0.318681 hartree
zpe.thermalcorrenthalpy: 0.319625 hartree
zpe.thermalcorrgfe: 0.258538 hartree
zpe.sumelectzpe: -652.803441 hartree
zpe.sumelectthermal: -652.787599 hartree
zpe.sumelectthermalent: -652.786654 hartree
zpe.sumelectthermalfe: -652.847742 hartree
dipole: -0.0733 -4.3607 2.0291
dipole: 4.8102
quadrupole: -77.4435 -100.9292 -90.5057
quadrupole: 2.3821 1.0725 2.3316
quadrupole: 12.1826 -11.3031 -0.8796 2.3821 1.0725 2.3316
hfenergy: -653.1062796 hartree
pointgroup: C01 [X(C12H20N2O1)]
dipole: -0.090125 -1.8065653 0.5565445 debye
polarizability: 176.3989673|-15.1605544|133.389695|4.1489421|-2.7890078|120.4351551 unknown
InChI: InChI=1S/C12H20N2O/c1-9(2)6-7-14-8-10-4-5-11(12(14)15)13(10)3/h6,10-11H,4-5,7-8H2,1-3H3
charge 0 multiplicity 1
35 atoms
O  -0.586816 2.627614 -0.235636
N  -2.102759 -0.56005 -0.967259
N  0.096258 0.471528 0.361548
C  -1.654886 -1.30789 0.248901
C  -2.234875 0.816751 -0.40333
C  -2.53297 -0.766337 1.442481
C  -3.006906 0.641614 0.955777
C  -0.157628 -0.987284 0.424458
C  -0.836041 1.3868 -0.111168
C  -3.340101 -1.079727 -1.592961
C  1.47793 0.929515 0.659622
C  2.479467 0.439501 -0.368139
C  3.602444 -0.305805 -0.15527
C  4.511937 -0.683451 -1.314376
C  4.07036 -0.807388 1.20089
H  -1.76856 -2.395527 0.09958
H  -2.728866 1.502078 -1.108157
H  -1.944723 -0.703734 2.374427
H  -3.389135 -1.436464 1.633473
H  -4.096998 0.664902 0.779388
H  -2.765178 1.446991 1.669137
H  0.202477 -1.368832 1.402355
H  0.423911 -1.491352 -0.371941
H  -4.222677 -1.131169 -0.911524
H  -3.147523 -2.095411 -1.981582
H  -3.606421 -0.436223 -2.449734
H  1.431908 2.034567 0.648571
H  1.747001 0.604519 1.681931
H  2.248228 0.750881 -1.397619
H  4.60796 -1.784333 -1.40113
H  4.135479 -0.293421 -2.275483
H  5.536109 -0.288643 -1.160814
H  3.359761 -0.595486 2.016351
H  4.24234 -1.90154 1.171004
H  5.039696 -0.343896 1.472229
