program: Gaussian 09
title: 000140869
version: EM64L-G09RevD.01
frameworkgroup: C1[X(C12H8ClNO2S)]
method: RPBEPBE
basis: SDD
operation: Freq
keyword: #p
keyword: freq=noraman
keyword: PBEPBE/SDD
title: #p freq=noraman PBEPBE/SDD
converged: YES YES NO NO
title: Mulliken charges:
elementType: Cl S O O N C C C C C C C C C C C C H H H H H H H H
charge: -0.032648 0.272639 -0.215395 -0.215148 0.022532 -0.224151 -0.248568 -0.197837 -0.101612 0.379980 -0.342449 -0.370175 -0.202607 -0.198086 -0.191422 -0.192310 -0.104807 0.252145 0.261975 0.289957 0.288728 0.268630 0.269391 0.265509 0.265731
chargesum: 0.00000
title: Mulliken charges with hydrogens summed into heavy atoms:
elementType: Cl S O O N C C C C C C C C C C C C
charge: -0.032648 0.272639 -0.215395 -0.215148 0.022532 -0.224151 -0.248568 0.054308 0.160363 0.379980 -0.052493 -0.081447 0.066023 0.071306 0.074086 0.073421 -0.104807
polarizability: 2.94058512e+02 6.13205765e+00 1.64986840e+02 1.68182494e+00 -3.60731733e-01 1.03472420e+02
1716.lowfreq: -12.6223 -4.2998 -2.3121 -0.0017 -0.0012 -0.0009 6.6081 29.8199 31.5806
frequency: 1.4471 29.7787 31.5365 72.6875 83.0215 110.2897 167.6338 199.6826 256.4859 262.3057 280.5016 323.2023 325.3254 383.6551 407.9466 410.1115 469.2657 480.9129 504.0806 513.3771 529.3380 618.9665 621.8170 662.2284 686.6153 701.9011 717.4013 723.2326 787.4773 829.4823 830.2126 839.3943 851.2816 955.1870 969.0522 982.9792 989.8334 992.6008 997.5749 1058.8903 1068.9411 1078.3826 1095.2586 1099.7135 1110.9672 1179.4175 1180.0098 1223.4353 1283.1902 1289.6027 1352.5805 1358.5141 1378.6599 1391.7057 1415.6768 1455.2214 1459.1971 1574.1366 1577.1248 1584.8467 1591.7477 3147.9391 3156.8090 3157.6246 3159.6734 3176.4086 3179.9872 3182.9368 3185.2832
redmass: 4.8656 8.3457 6.3144 6.9167 9.0310 8.8692 9.6950 11.9605 9.8831 7.2958 6.4507 5.4428 12.7714 8.2455 2.8926 2.9458 3.3640 5.1114 6.3017 8.5029 5.4641 7.1572 7.2022 5.0813 8.6327 4.1979 7.0947 4.5665 9.3223 1.3004 1.3885 1.2820 1.5013 1.3223 1.3702 1.3339 5.8070 1.3535 3.6151 3.8077 3.6149 2.6950 2.9467 1.3687 1.2916 1.2385 1.2483 4.8999 1.2363 1.2592 6.4730 4.8075 3.9837 8.5482 4.6712 2.1792 2.1891 6.3449 7.9082 8.0330 6.3331 1.0904 1.0896 1.0893 1.0888 1.0969 1.0980 1.0950 1.0961
irintensity: 0.1733 0.3150 0.2487 0.1603 1.8461 0.6714 1.6220 2.1738 1.4181 1.3854 0.0638 0.1782 0.8248 9.1984 0.0026 0.0723 11.2007 29.0265 2.0153 18.2629 11.4635 0.0472 0.6494 18.1134 0.8419 0.7695 11.1391 9.7373 36.0318 20.3777 50.9652 9.9440 42.9155 0.0919 0.0217 3.8656 109.2314 1.4836 6.2894 57.2980 68.7339 6.9543 8.8175 7.8590 12.9580 86.6354 39.3243 464.9217 0.6424 0.5954 59.0632 0.4187 10.4441 55.9247 25.1909 103.0803 13.9481 17.7110 1.0558 2.5763 213.6099 3.4452 0.6920 1.3852 0.7583 2.2987 0.4530 0.0317 2.6622
temp: 298.150 k
press: 1.00000 atm
elementType: 17 16 8 8 7 6 6 6 6 6 6 6 6 6 6 6 6 1 1 1 1 1 1 1 1
symmnumber: 1
zpe: 447126.4 jmol-1
zpe.correction: 0.170301 hartree
zpe.thermalcorrener: 0.185258 hartree
zpe.thermalcorrenthalpy: 0.186202 hartree
zpe.thermalcorrgfe: 0.122347 hartree
zpe.sumelectzpe: -1524.123643 hartree
zpe.sumelectthermal: -1524.108686 hartree
zpe.sumelectthermalent: -1524.107742 hartree
zpe.sumelectthermalfe: -1524.171597 hartree
dipole: -4.7421 2.7189 0.0145
dipole: 5.4663
quadrupole: -146.4448 -117.1860 -104.7972
quadrupole: 14.5064 0.5450 -0.3631
quadrupole: -23.6355 5.6233 18.0121 14.5064 0.5450 -0.3631
hfenergy: -1524.2939442 hartree
pointgroup: C01 [X(C12H8Cl1N1O2S1)]
dipole: 1.9605971 0.7692179 0.4352255 debye
dipolederiv: -0.6072445 0.3393878 0.1357875 0.4611142 -0.3472297 -0.0926499 0.1924319 -0.0972757 -0.1514986 -0.6523254 -0.1571198 -0.1006259 -0.3857909 0.0455984 0.0327134 -0.2291447 0.0450377 -0.048564 -1.1342982 0.0651982 -0.0147427 0.1949403 -0.4314962 -0.076811 0.0416372 -0.0832214 -0.2700334 -0.5852997 -0.0969194 -0.0597177 -0.3713601 -0.7905797 -0.2628132 -0.1807028 -0.2500547 -0.3522205 2.1338349 0.2899075 0.2215961 0.5026027 1.0800546 0.4169946 0.3172947 0.4072812 0.3834461 1.2230566 0.3620867 0.2198595 0.6378432 0.1069735 0.0923671 0.3677335 0.0769812 0.0009892 0.3879879 -0.1978699 -0.0720431 -0.3424269 -0.087106 -0.0431172 -0.1309034 -0.0376795 -0.0389969 -0.803873 -0.1104673 -0.0799523 -0.0945845 0.1149517 0.0993407 -0.0732918 0.09845 -0.0786182 -0.399992 -0.2110914 -0.1038423 -0.5224228 -0.2498122 -0.0928228 -0.2492958 -0.0805962 -0.1409377 -0.968089 -0.2936767 -0.1767702 -0.4350776 -0.1649272 -0.1097178 -0.2438886 -0.1035068 -0.0208235 0.2375511 0.034729 0.0328725 0.4403226 0.0921409 0.1033646 0.2082146 0.0853469 -0.0493277 0.5001648 0.2062127 0.1190866 -0.0683615 -0.0126674 0.0300155 0.0011423 0.0441927 -0.0698788 -0.1380219 -0.0146341 -0.090698 -0.0217259 -0.0333804 0.0334526 0.1745718 -0.0904567 0.0379664 -0.1361599 -0.0755125 0.0431023 0.123703 -0.0328353 -0.0917975 -0.1332506 0.0255906 0.0244489 -0.3075181 0.0777156 0.1268269 0.1282493 -0.1144345 -0.1228276 0.1199826 -0.0997617 -0.0862083 -0.299348 0.1469001 -0.038414 0.1728633 -0.2127971 -0.0005583 0.0102195 -0.0278942 0.0120174 0.8328798 -0.6108704 -0.2490044 -0.7331685 0.4791669 0.1298488 -0.3095495 0.1343695 0.2072058 0.1092526 -0.0406122 -0.0209374 -0.0114427 -0.0154992 -0.0743067 -0.0061984 -0.0762396 0.1208436 0.049018 0.0436021 0.0131705 0.1014302 0.0477146 -0.0260635 0.0357608 -0.0278249 0.1050167 0.0452783 0.05903 0.0193025 0.0044545 0.1147856 -0.0241954 -0.004902 -0.0221244 0.1615139 0.1025001 -0.0178488 -0.0106016 0.0122776 0.056669 -0.0463646 0.0040006 -0.0482869 0.1444276 0.1271776 0.0280987 0.0779967 0.0071196 0.1015742 -0.0060953 0.0827791 0.0131561 0.004516 0.1271914 0.0741294 -0.0323311 0.0634945 0.053419 0.0577906 -0.0520047 0.0407689 0.0473438 0.0788813 0.06699 -0.0208993 0.085096 0.0736012 0.0665804 -0.0118687 0.0590226 0.054383 0.0773951 0.0326348 0.0609788 0.0508506 0.1261156 0.0076723 0.0692325 0.0147253 0.0029889 unknown
polarizability: 291.2074928|-20.6381761|156.4629147|0.1560989|24.0254761|114.8473648 unknown
InChI: InChI=1S/C12H8ClNO2S/c13-9-1-5-11(6-2-9)17-12-7-3-10(4-8-12)14(15)16/h1-8H
charge 0 multiplicity 1
25 atoms
Cl 5.6036 -2.040854 -0.778213
S  0.861568 2.008346 0.908846
O  -5.518187 0.00273 -0.300039
O  -4.423873 -1.850776 -1.062991
N  -4.43783 -0.666721 -0.541893
C  -0.686528 1.139702 0.44405
C  2.169507 0.808684 0.407531
C  -1.897868 1.842362 0.687211
C  -0.716671 -0.157653 -0.124567
C  -3.144265 -0.042427 -0.202023
C  -3.131723 1.252926 0.365424
C  -1.948992 -0.75322 -0.450106
C  2.689155 -0.09794 1.360113
C  2.699567 0.854936 -0.902671
C  3.74056 -0.972763 1.002292
C  3.749219 -0.017084 -1.270972
C  4.251535 -0.917742 -0.310035
H  -1.873359 2.84563 1.125536
H  0.213644 -0.701455 -0.311845
H  -4.07721 1.771813 0.542767
H  -2.000544 -1.753105 -0.889064
H  2.278973 -0.122763 2.374163
H  2.299799 1.566236 -1.63178
H  4.151689 -1.677013 1.730933
H  4.166735 0.009151 -2.281268
